{"text_format":"1","workbook":"xlsx","n_sheets":9,"sheets":["Settings & Instructions","Total Projections (excl QB)","QB Projections","Total Rankings (excl QB)","QB Rankings","Positional Ranks","To Hide","Arizona Cardinals","INPUTS"],"not_rendered":{"charts":0,"images":6,"macros":1,"external_links":0,"defined_names":2,"comments":1,"pivot_tables":0},"unopened":[],"bounds":{"document_bytes":16777216,"sheet_cells":100000,"rows_first":2000,"rows_last":500,"rows_between":2000,"halvings":0,"cell_chars":16384,"cell_head_chars":4096},"cells_cut":0,"cells_raw":0,"read":"whole","date_system":"1900"}

{"sheet":"Settings & Instructions","index":0,"n_rows":40,"n_cols":27,"rows_kept":40,"cut":false,"hidden":false,"merged":[]}
[null,"Welcome to the Yards Per Fantasy Projections Template! Instructions are below - have fun and hit us up with any questions or issues (admin@yardsperfantasy.com)",null,null,null,null,null,null,null,null,null,null,null,null,null,null,null,null,null,null,null,null,null,null,null,1,"Week 1"]
[null,"Not sure where to start? Check out our article on how to go about your projections",null,null,null,null,null,null,null,null,null,null,null,null,null,null,null,null,null,null,null,null,null,null,null,2,"Week 2"]
[null,"When you've finished, export your rankings and don't forget to tag us on Twitter",null,null,null,null,null,null,null,null,null,null,null,null,null,null,null,null,null,null,null,null,null,null,null,3,"Week 3"]
[null,null,null,null,null,null,null,null,null,null,null,null,null,null,null,null,null,null,null,null,null,null,null,null,null,4,"Week 4"]
["League Settings",null,"{Manual Entry - update to match your individual settings}",null,null,null,null,null,null,null,null,null,null,null,null,null,null,null,null,null,null,null,null,null,null,5,"Week 5"]
[null,null,"Value","SFB 12 Settings",null,null,null,null,null,null,null,null,null,null,null,null,null,null,null,null,null,null,null,null,null,6,"Week 6"]
[null,"QB Passing TDs",4,6,null,null,null,null,null,null,null,null,null,null,null,null,null,null,null,null,null,null,null,null,null,7,"Week 7"]
[null,"QB Passing Yards",{"$f":"1/25","v":0.04},0.04,null,null,null,null,null,null,null,null,null,null,null,null,null,null,null,null,null,null,null,null,null,8,"Week 8"]
{"$rows_left_out":33}
{"sheet":"Total Projections (excl QB)","index":1,"n_rows":514,"n_cols":19,"rows_kept":514,"cut":false,"hidden":false,"merged":[]}
["Total Projections (Excl QB)"]
["Rank","Team","Position","Player","Targets","Catch %","Receptions","Premium","1st Downs Rush (Calculated)","1st Downs Rec (Calculated)","Yards per Reception","Receiving Yards","Receiving TDs","Rush Att","Yards per Carry","Rushing Yards","Rushing TDs","Fantasy Points (Excl 1st downs)","Fantasy Points (incl 1st downs)"]
[{"$f":"RANK(S3,$S:$S,0)+COUNTIF($S$3:S3,S3)-1","v":1},"Arizona Cardinals","Running Back",{"$f":"'Arizona Cardinals'!$B$127","v":"James Conner"},{"$f":"'Arizona Cardinals'!$D$127","v":50.591999999999999},{"$f":"'Arizona Cardinals'!$E$127","v":0.75},{"$f":"'Arizona Cardinals'!$F$127","v":37.944000000000003},{"$f":"'Arizona Cardinals'!$O$127","v":0},{"$f":"IF(((0.0572*P3)-2.646)<0,0,(0.0572*P3)-2.646)","v":40.761936000000006},{"$f":"IF(G3=0,0,(0.0461*L3)+2.0516)","v":13.421519600000002},{"$f":"'Arizona Cardinals'!$G$127","v":6.5},{"$f":"'Arizona Cardinals'!$H$127","v":246.63600000000002},{"$f":"'Arizona Cardinals'!$I$127","v":1},{"$f":"'Arizona Cardinals'!$K$127","v":189.72000000000003},{"$f":"'Arizona Cardinals'!$L$127","v":4},{"$f":"'Arizona Cardinals'!$M$127","v":758.88000000000011},{"$f":"'Arizona Cardinals'!$N$127","v":6},{"$f":"'Arizona Cardinals'!$P$127","v":180.49560000000002},{"$f":"IF(R3=0,0,(R3+(I3*'Settings & Instructions'!$C$20)+(J3*'Settings & Instructions'!$C$21)+IF(C3=\"Tight End\",J3*'Settings & Instructions'!$C$22,0)))","v":180.49560000000002}]
[{"$f":"RANK(S4,$S:$S,0)+COUNTIF($S$3:S4,S4)-1","v":8},"Arizona Cardinals","Running Back",{"$f":"'Arizona Cardinals'!$B$128","v":"Corey Clement"},{"$f":"'Arizona Cardinals'!$D$128","v":18.971999999999998},{"$f":"'Arizona Cardinals'!$E$128","v":0.7},{"$f":"'Arizona Cardinals'!$F$128","v":13.280399999999998},{"$f":"'Arizona Cardinals'!$O$128","v":0},{"$f":"IF(((0.0572*P4)-2.646)<0,0,(0.0572*P4)-2.646)","v":11.823312000000001},{"$f":"IF(G4=0,0,(0.0461*L4)+2.0516)","v":5.7249586399999997},{"$f":"'Arizona Cardinals'!$G$128","v":6},{"$f":"'Arizona Cardinals'!$H$128","v":79.682399999999987},{"$f":"'Arizona Cardinals'!$I$128","v":0},{"$f":"'Arizona Cardinals'!$K$128","v":63.240000000000009},{"$f":"'Arizona Cardinals'!$L$128","v":4},{"$f":"'Arizona Cardinals'!$M$128","v":252.96000000000004},{"$f":"'Arizona Cardinals'!$N$128","v":2},{"$f":"'Arizona Cardinals'!$P$128","v":58.544640000000001},{"$f":"IF(R4=0,0,(R4+(I4*'Settings & Instructions'!$C$20)+(J4*'Settings & Instructions'!$C$21)+IF(C4=\"Tight End\",J4*'Settings & Instructions'!$C$22,0)))","v":58.544640000000001}]
[{"$f":"RANK(S5,$S:$S,0)+COUNTIF($S$3:S5,S5)-1","v":7},"Arizona Cardinals","Running Back",{"$f":"'Arizona Cardinals'!$B$129","v":"Keaontay Ingram"},{"$f":"'Arizona Cardinals'!$D$129","v":18.971999999999998},{"$f":"'Arizona Cardinals'!$E$129","v":0.75},{"$f":"'Arizona Cardinals'!$F$129","v":14.228999999999999},{"$f":"'Arizona Cardinals'!$O$129","v":0},{"$f":"IF(((0.0572*P5)-2.646)<0,0,(0.0572*P5)-2.646)","v":11.823312000000001},6.3153198499999998,{"$f":"'Arizona Cardinals'!$G$129","v":6.5},{"$f":"'Arizona Cardinals'!$H$129","v":92.488499999999988},{"$f":"'Arizona Cardinals'!$I$129","v":0},{"$f":"'Arizona Cardinals'!$K$129","v":63.240000000000009},{"$f":"'Arizona Cardinals'!$L$129","v":4},{"$f":"'Arizona Cardinals'!$M$129","v":252.96000000000004},{"$f":"'Arizona Cardinals'!$N$129","v":2},{"$f":"'Arizona Cardinals'!$P$129","v":60.773850000000003},{"$f":"IF(R5=0,0,(R5+(I5*'Settings & Instructions'!$C$20)+(J5*'Settings & Instructions'!$C$21)+IF(C5=\"Tight End\",J5*'Settings & Instructions'!$C$22,0)))","v":60.773850000000003}]
[{"$f":"RANK(S6,$S:$S,0)+COUNTIF($S$3:S6,S6)-1","v":12},"Arizona Cardinals","Running Back",{"$f":"'Arizona Cardinals'!$B$130","v":0},{"$f":"'Arizona Cardinals'!$D$130","v":0},{"$f":"'Arizona Cardinals'!$E$130","v":0},{"$f":"'Arizona Cardinals'!$F$130","v":0},{"$f":"'Arizona Cardinals'!$O$130","v":0},{"$f":"IF(((0.0572*P6)-2.646)<0,0,(0.0572*P6)-2.646)","v":0},0,{"$f":"'Arizona Cardinals'!$G$130","v":0},{"$f":"'Arizona Cardinals'!$H$130","v":0},{"$f":"'Arizona Cardinals'!$I$130","v":0},{"$f":"'Arizona Cardinals'!$K$130","v":0},{"$f":"'Arizona Cardinals'!$L$130","v":0},{"$f":"'Arizona Cardinals'!$M$130","v":0},{"$f":"'Arizona Cardinals'!$N$130","v":0},{"$f":"'Arizona Cardinals'!$P$130","v":0},{"$f":"IF(R6=0,0,(R6+(I6*'Settings & Instructions'!$C$20)+(J6*'Settings & Instructions'!$C$21)+IF(C6=\"Tight End\",J6*'Settings & Instructions'!$C$22,0)))","v":0}]
[{"$f":"RANK(S7,$S:$S,0)+COUNTIF($S$3:S7,S7)-1","v":3},"Arizona Cardinals","Wide Receiver",{"$f":"'Arizona Cardinals'!$B$108","v":"Marquise Brown"},{"$f":"'Arizona Cardinals'!$D$108","v":113.83199999999999},{"$f":"'Arizona Cardinals'!$E$108","v":0.63},{"$f":"'Arizona Cardinals'!$F$108","v":71.714159999999993},{"$f":"'Arizona Cardinals'!$O$108","v":0},{"$f":"IF(((0.0572*P7)-2.646)<0,0,(0.0572*P7)-2.646)","v":0},{"$f":"IF(G7=0,0,(0.0461*L7)+2.0516)","v":35.111827759999997},{"$f":"'Arizona Cardinals'!$G$108","v":10},{"$f":"'Arizona Cardinals'!$H$108","v":717.14159999999993},{"$f":"'Arizona Cardinals'!$I$108","v":3},{"$f":"'Arizona Cardinals'!$K$108","v":0},{"$f":"'Arizona Cardinals'!$L$108","v":0},{"$f":"'Arizona Cardinals'!$M$108","v":0},{"$f":"'Arizona Cardinals'!$N$108","v":0},{"$f":"'Arizona Cardinals'!$P$108","v":161.42831999999999},{"$f":"IF(R7=0,0,(R7+(I7*'Settings & Instructions'!$C$20)+(J7*'Settings & Instructions'!$C$21)+IF(C7=\"Tight End\",J7*'Settings & Instructions'!$C$22,0)))","v":161.42831999999999}]
[{"$f":"RANK(S8,$S:$S,0)+COUNTIF($S$3:S8,S8)-1","v":4},"Arizona Cardinals","Wide Receiver",{"$f":"'Arizona Cardinals'!$B$109","v":"DeAndre Hopkins"},{"$f":"'Arizona Cardinals'!$D$109","v":113.83199999999999},{"$f":"'Arizona Cardinals'!$E$109","v":0.6},{"$f":"'Arizona Cardinals'!$F$109","v":68.299199999999999},{"$f":"'Arizona Cardinals'!$O$109","v":0},{"$f":"IF(((0.0572*P8)-2.646)<0,0,(0.0572*P8)-2.646)","v":0},{"$f":"IF(G8=0,0,(0.0461*L8)+2.0516)","v":31.963234640000003},{"$f":"'Arizona Cardinals'!$G$109","v":9.5},{"$f":"'Arizona Cardinals'!$H$109","v":648.8424},{"$f":"'Arizona Cardinals'!$I$109","v":4},{"$f":"'Arizona Cardinals'!$K$109","v":0},{"$f":"'Arizona Cardinals'!$L$109","v":0},{"$f":"'Arizona Cardinals'!$M$109","v":0},{"$f":"'Arizona Cardinals'!$N$109","v":0},{"$f":"'Arizona Cardinals'!$P$109","v":157.18344000000002},{"$f":"IF(R8=0,0,(R8+(I8*'Settings & Instructions'!$C$20)+(J8*'Settings & Instructions'!$C$21)+IF(C8=\"Tight End\",J8*'Settings & Instructions'!$C$22,0)))","v":157.18344000000002}]
{"$rows_left_out":507}
{"sheet":"QB Projections","index":2,"n_rows":66,"n_cols":16,"rows_kept":66,"cut":false,"hidden":false,"merged":[]}
["Quarterback Projections"]
["Rank","Team","Player","Pass Att.","Completions","Pass Yds.","Pass TD","Int","Rush Att.","Rushing Yds","Rushing TDs","Fantasy Points (excl 1st down)","Fantasy Points (incl 1st down)","QB Completion %","QB TD %","YPA"]
[{"$f":"RANK(M3,$M:$M,0)+COUNTIF($M$3:M3,M3)-1","v":1},"Arizona Cardinals",{"$f":"'Arizona Cardinals'!$B$97","v":"Kyler Murray"},{"$f":"'Arizona Cardinals'!$C$97","v":538.428},{"$f":"'Arizona Cardinals'!$D$97","v":355.26371999999992},{"$f":"'Arizona Cardinals'!$E$97","v":3069.0279},{"$f":"'Arizona Cardinals'!$F$97","v":18},{"$f":"'Arizona Cardinals'!$G$97","v":7},{"$f":"'Arizona Cardinals'!$I$97","v":63.240000000000009},{"$f":"'Arizona Cardinals'!$K$97","v":392.08800000000008},{"$f":"'Arizona Cardinals'!$L$97","v":2},{"$f":"'Arizona Cardinals'!$P$97","v":231.96991600000001},{"$f":"L3+(((0.0572*J3)-2.646)*'Settings & Instructions'!$C$20)","v":231.96991600000001},{"$f":"'Arizona Cardinals'!$M$97","v":0.65981657714680497},{"$f":"'Arizona Cardinals'!$N$97","v":3.3430653680714968E-2},{"$f":"'Arizona Cardinals'!$O$97","v":5.6999782700751078}]
[{"$f":"RANK(M4,$M:$M,0)+COUNTIF($M$3:M4,M4)-1","v":2},"Arizona Cardinals",{"$f":"'Arizona Cardinals'!$B$98","v":"Colt McCoy"},{"$f":"'Arizona Cardinals'!$C$98","v":75},{"$f":"'Arizona Cardinals'!$D$98","v":46.5},{"$f":"'Arizona Cardinals'!$E$98","v":418.5},{"$f":"'Arizona Cardinals'!$F$98","v":4},{"$f":"'Arizona Cardinals'!$G$98","v":3},{"$f":"'Arizona Cardinals'!$I$98","v":21.080000000000005},{"$f":"'Arizona Cardinals'!$K$98","v":94.860000000000028},{"$f":"'Arizona Cardinals'!$L$98","v":0},{"$f":"'Arizona Cardinals'!$P$98","v":36.226000000000006},{"$f":"L4+(((0.0572*J4)-2.646)*'Settings & Instructions'!$C$20)","v":36.226000000000006},{"$f":"'Arizona Cardinals'!$M$98","v":0.62},{"$f":"'Arizona Cardinals'!$N$98","v":5.3333333333333337E-2},{"$f":"'Arizona Cardinals'!$O$98","v":5.58}]
[null,"Atlanta Falcons"]
[null,"Atlanta Falcons"]
[null,"Baltimore Ravens"]
[null,"Baltimore Ravens"]
{"$rows_left_out":59}
{"sheet":"Total Rankings (excl QB)","index":3,"n_rows":514,"n_cols":9,"rows_kept":514,"cut":false,"hidden":false,"merged":[]}
["Total Rankings (Excl QB)"]
["Rank","Team","Position","Player","Fantasy Points","Pos Rank",null,"PPR & Premium Settings"]
[1,{"$f":"VLOOKUP($A3,'Total Projections (excl QB)'!$A:$T,2,0)","v":"Arizona Cardinals"},{"$f":"VLOOKUP($A3,'Total Projections (excl QB)'!$A:$T,3,0)","v":"Running Back"},{"$f":"VLOOKUP($A3,'Total Projections (excl QB)'!$A:$T,4,0)","v":"James Conner"},{"$f":"VLOOKUP($A3,'Total Projections (excl QB)'!$A:$T,19,0)","v":180.49560000000002},{"$f":"COUNTIFS(C:C,C3,E:E,\">\"&E3)+1","v":1}]
[2,{"$f":"VLOOKUP($A4,'Total Projections (excl QB)'!$A:$T,2,0)","v":"Arizona Cardinals"},{"$f":"VLOOKUP($A4,'Total Projections (excl QB)'!$A:$T,3,0)","v":"Tight End"},{"$f":"VLOOKUP($A4,'Total Projections (excl QB)'!$A:$T,4,0)","v":"Zach Ertz"},{"$f":"VLOOKUP($A4,'Total Projections (excl QB)'!$A:$T,19,0)","v":165.45038399999999},1,null,"Receptions",{"$f":"'Settings & Instructions'!C13","v":1}]
[3,{"$f":"VLOOKUP($A5,'Total Projections (excl QB)'!$A:$T,2,0)","v":"Arizona Cardinals"},{"$f":"VLOOKUP($A5,'Total Projections (excl QB)'!$A:$T,3,0)","v":"Wide Receiver"},{"$f":"VLOOKUP($A5,'Total Projections (excl QB)'!$A:$T,4,0)","v":"Marquise Brown"},{"$f":"VLOOKUP($A5,'Total Projections (excl QB)'!$A:$T,19,0)","v":161.42831999999999},1,null,"Premium - Tight End",{"$f":"'Settings & Instructions'!C14","v":1}]
[4,{"$f":"VLOOKUP($A6,'Total Projections (excl QB)'!$A:$T,2,0)","v":"Arizona Cardinals"},{"$f":"VLOOKUP($A6,'Total Projections (excl QB)'!$A:$T,3,0)","v":"Wide Receiver"},{"$f":"VLOOKUP($A6,'Total Projections (excl QB)'!$A:$T,4,0)","v":"DeAndre Hopkins"},{"$f":"VLOOKUP($A6,'Total Projections (excl QB)'!$A:$T,19,0)","v":157.18344000000002},2,null,"Premium - Wide Receiver",{"$f":"'Settings & Instructions'!C15","v":0}]
[5,{"$f":"VLOOKUP($A7,'Total Projections (excl QB)'!$A:$T,2,0)","v":"Arizona Cardinals"},{"$f":"VLOOKUP($A7,'Total Projections (excl QB)'!$A:$T,3,0)","v":"Tight End"},{"$f":"VLOOKUP($A7,'Total Projections (excl QB)'!$A:$T,4,0)","v":"Trey McBride"},{"$f":"VLOOKUP($A7,'Total Projections (excl QB)'!$A:$T,19,0)","v":125.28665999999998},2,null,"Premium - Running Back",{"$f":"'Settings & Instructions'!C16","v":0}]
[6,{"$f":"VLOOKUP($A8,'Total Projections (excl QB)'!$A:$T,2,0)","v":"Arizona Cardinals"},{"$f":"VLOOKUP($A8,'Total Projections (excl QB)'!$A:$T,3,0)","v":"Wide Receiver"},{"$f":"VLOOKUP($A8,'Total Projections (excl QB)'!$A:$T,4,0)","v":"Rondale Moore"},{"$f":"VLOOKUP($A8,'Total Projections (excl QB)'!$A:$T,19,0)","v":67.975200000000001},3]
{"$rows_left_out":507}
{"sheet":"QB Rankings","index":4,"n_rows":66,"n_cols":4,"rows_kept":66,"cut":false,"hidden":false,"merged":[]}
["Quarterback Projections"]
["Rank","Team","Player","Fantasy Points"]
[1,{"$f":"VLOOKUP($A3,'QB Projections'!$A:$M,2,0)","v":"Arizona Cardinals"},{"$f":"VLOOKUP($A3,'QB Projections'!$A:$M,3,0)","v":"Kyler Murray"},{"$f":"VLOOKUP($A3,'QB Projections'!$A:$M,13,0)","v":231.96991600000001}]
[2,{"$f":"VLOOKUP($A4,'QB Projections'!$A:$M,2,0)","v":"Arizona Cardinals"},{"$f":"VLOOKUP($A4,'QB Projections'!$A:$M,3,0)","v":"Colt McCoy"},{"$f":"VLOOKUP($A4,'QB Projections'!$A:$M,13,0)","v":36.226000000000006}]
[3]
[4]
[5]
[6]
{"$rows_left_out":59}
{"sheet":"Positional Ranks","index":5,"n_rows":194,"n_cols":23,"rows_kept":194,"cut":false,"hidden":false,"merged":[]}
["Wide Receiver",null,null,null,null,null,"Running Back",null,null,null,null,null,"Tight End",null,null,null,null,null,"Quarterback"]
["Rank","Player","Fantasy Points","Points per Game","Tier",null,"Rank","Player","Fantasy Points","Points per Game","Tier",null,"Rank","Player","Fantasy Points","Points per Game","Tier",null,"Rank","Player","Fantasy Points","Points per Game","Tier"]
[1,{"$f":"INDEX('Total Rankings (excl QB)'!$D:$D,MATCH(1,(\"Wide Receiver\"='Total Rankings (excl QB)'!$C:$C)*(A3='Total Rankings (excl QB)'!$F:$F),0),1)","v":"Marquise Brown"},{"$f":"VLOOKUP($B3,'Total Rankings (excl QB)'!$D:$E,2,0)","v":161.42831999999999},{"$f":"C3/17","v":9.4957835294117636},null,null,1,{"$f":"INDEX('Total Rankings (excl QB)'!$D:$D,MATCH(1,(\"Running Back\"='Total Rankings (excl QB)'!$C:$C)*(G3='Total Rankings (excl QB)'!$F:$F),0),1)","v":"James Conner"},{"$f":"VLOOKUP($H3,'Total Rankings (excl QB)'!$D:$E,2,0)","v":180.49560000000002},{"$f":"I3/17","v":10.617388235294118},null,null,1,{"$f":"INDEX('Total Rankings (excl QB)'!$D:$D,MATCH(1,(\"Tight End\"='Total Rankings (excl QB)'!$C:$C)*(M3='Total Rankings (excl QB)'!$F:$F),0),1)","v":"Zach Ertz"},{"$f":"VLOOKUP($N3,'Total Rankings (excl QB)'!$D:$E,2,0)","v":165.45038399999999},{"$f":"O3/17","v":9.7323755294117635},null,null,1,{"$f":"'QB Rankings'!C3","v":"Kyler Murray"},{"$f":"'QB Rankings'!D3","v":231.96991600000001},{"$f":"U3/17","v":13.645289176470589}]
[2,{"$f":"INDEX('Total Rankings (excl QB)'!$D:$D,MATCH(1,(\"Wide Receiver\"='Total Rankings (excl QB)'!$C:$C)*(A4='Total Rankings (excl QB)'!$F:$F),0),1)","v":"DeAndre Hopkins"},{"$f":"VLOOKUP($B4,'Total Rankings (excl QB)'!$D:$E,2,0)","v":157.18344000000002},{"$f":"C4/17","v":9.2460847058823532},null,null,2,{"$f":"INDEX('Total Rankings (excl QB)'!$D:$D,MATCH(1,(\"Running Back\"='Total Rankings (excl QB)'!$C:$C)*(G4='Total Rankings (excl QB)'!$F:$F),0),1)","v":"Keaontay Ingram"},{"$f":"VLOOKUP($H4,'Total Rankings (excl QB)'!$D:$E,2,0)","v":60.773850000000003},{"$f":"I4/17","v":3.5749323529411767},null,null,2,{"$f":"INDEX('Total Rankings (excl QB)'!$D:$D,MATCH(1,(\"Tight End\"='Total Rankings (excl QB)'!$C:$C)*(M4='Total Rankings (excl QB)'!$F:$F),0),1)","v":"Trey McBride"},{"$f":"VLOOKUP($N4,'Total Rankings (excl QB)'!$D:$E,2,0)","v":125.28665999999998},{"$f":"O4/17","v":7.3698035294117634},null,null,2,{"$f":"'QB Rankings'!C4","v":"Colt McCoy"},{"$f":"'QB Rankings'!D4","v":36.226000000000006},{"$f":"U4/17","v":2.1309411764705888}]
[3,{"$f":"INDEX('Total Rankings (excl QB)'!$D:$D,MATCH(1,(\"Wide Receiver\"='Total Rankings (excl QB)'!$C:$C)*(A5='Total Rankings (excl QB)'!$F:$F),0),1)","v":"Rondale Moore"},{"$f":"VLOOKUP($B5,'Total Rankings (excl QB)'!$D:$E,2,0)","v":67.975200000000001},3.9985411764705883,null,null,3,{"$f":"INDEX('Total Rankings (excl QB)'!$D:$D,MATCH(1,(\"Running Back\"='Total Rankings (excl QB)'!$C:$C)*(G5='Total Rankings (excl QB)'!$F:$F),0),1)","v":"Corey Clement"},{"$f":"VLOOKUP($H5,'Total Rankings (excl QB)'!$D:$E,2,0)","v":58.544640000000001},3.4438023529411765,null,null,3,null,null,null,null,null,3]
[4,{"$f":"INDEX('Total Rankings (excl QB)'!$D:$D,MATCH(1,(\"Wide Receiver\"='Total Rankings (excl QB)'!$C:$C)*(A6='Total Rankings (excl QB)'!$F:$F),0),1)","v":"Greg Dortch"},{"$f":"VLOOKUP($B6,'Total Rankings (excl QB)'!$D:$E,2,0)","v":57.793559999999999},3.3996211764705881,null,null,4,null,null,null,null,null,4,null,null,null,null,null,4]
[5,{"$f":"INDEX('Total Rankings (excl QB)'!$D:$D,MATCH(1,(\"Wide Receiver\"='Total Rankings (excl QB)'!$C:$C)*(A7='Total Rankings (excl QB)'!$F:$F),0),1)","v":"Zach Pascal"},{"$f":"VLOOKUP($B7,'Total Rankings (excl QB)'!$D:$E,2,0)","v":27.628079999999997},1.6251811764705881,null,null,5,null,null,null,null,null,5,null,null,null,null,null,5]
[6,{"$f":"INDEX('Total Rankings (excl QB)'!$D:$D,MATCH(1,(\"Wide Receiver\"='Total Rankings (excl QB)'!$C:$C)*(A8='Total Rankings (excl QB)'!$F:$F),0),1)","v":"Michael Wilson"},{"$f":"VLOOKUP($B8,'Total Rankings (excl QB)'!$D:$E,2,0)","v":21.683520000000001},1.2755011764705884,null,null,6,null,null,null,null,null,6,null,null,null,null,null,6]
{"$rows_left_out":187}
{"sheet":"To Hide","index":6,"n_rows":23,"n_cols":8,"rows_kept":23,"cut":false,"hidden":true,"merged":[]}
["Wide Receivers",null,null,"Select Rankings",{"$f":"#REF!","v":{"$error":"#REF!"}}]
["Running Backs"]
["Tight Ends"]
["Quarterbacks"]
[]
[]
[]
[null,null,null,null,null,null,null,{"$f":"E1","v":{"$error":"#REF!"}}]
{"$rows_left_out":16}
{"sheet":"Arizona Cardinals","index":7,"n_rows":705,"n_cols":26,"rows_kept":705,"cut":false,"hidden":false,"merged":[[26,9,27,9]]}
[null,null,null,"*If the file is running slow, ensure Calculation Options (under the Formulas menu) is set to 'Manual'. Then Press F9 to Calculate at any time*"]
[]
[null,null,"ARI"]
[null,null,null,null,null,"2023 Schedule",null,null,null,"2022 Results"]
[null,null,"Arizona Cardinals",null,null,"Week","@","Opponent",null,"Team Totals","Opponent","Off Plays","Pass Att","Rush Att","Pass %",null,"Total TDs","Pass TDs","Rush TDs","Pass TD %"]
[null,null,null,null,null,"Week 1","@","Washington Commanders",null,"Week 1","Kansas City Chiefs",60,38,22,0.6333333333333333,null,3,2,1,0.66666666666666663]
[null,null,null,null,null,"Week 2","","New York Giants",null,"Week 2","@ Las Vegas Raiders",77,49,28,0.63636363636363635,null,3,1,2,0.33333333333333331]
[null,"Head Coach",null,"Jonathan Gannon",null,"Week 3","","Dallas Cowboys",null,"Week 3","Los Angeles Rams",79,58,21,0.73417721518987344,null,0,0,0,{"$error":"#DIV/0!"}]
{"$rows_left_out":698}
{"sheet":"INPUTS","index":8,"n_rows":526,"n_cols":106,"rows_kept":526,"cut":false,"hidden":true,"merged":[[1,36,1,37],[1,38,1,44],[1,72,1,73],[1,74,1,85]]}
["Wins","Touchdowns",null,null,"PASSING",null,null,null,null,null,null,null,null,null,null,null,null,null,null,null,null,null,null,null,null,null,null,null,null,null,null,null,null,null,null,null,"RUSHING",null,null,null,null,null,null,null,null,null,null,null,null,null,null,null,"RECEIVING",null,null,null,null,null,null,null,null,null,null,null,null,null,null,null,null,null,null,null,"Advanced Passing",null,null,null,null,null,null,null,null,null,null,null,null,null,null,null,null,null,null,null,null,"Tiers"]
[1,30,null,null,null,null,null,null,null,null,null,null,null,null,null,null,null,null,null,null,null,null,null,null,null,null,null,null,null,null,null,null,null,null,null,null,"Games",null,"Rushing",null,null,null,null,null,null,null,null,null,null,null,null,null,"Rk","Player","Tm","Age","Pos","G","GS","Tgt","Rec","Ctch%","Yds","Y/R","TD","1D","Lng","Y/Tgt","R/G","Y/G","Fmb",null,"Games",null,"Passing"]
[1.5,30,null,null,"Rk","Player","Tm","Age","Pos","G","GS","QBrec","Cmp","Att","Cmp%","Yds","TD","TD%","Int","Int%","1D","Lng","Y/A","AY/A","Y/C","Y/G","Rate","QBR","Sk","Yds","Sk%","NY/A","ANY/A","4QC","GWD",null,"Rk","Player","Tm","Age","Pos","G","GS","Att","Yds","TD","1D","Lng","Y/A","Y/G","Fmb",null,1,"Justin Jefferson","MIN",23,"WR",17,17,184,128,0.69599999999999995,1809,14.1,8,80,64,9.8000000000000007,7.5,106.4,0,null,"Rk","Player","Tm","Age","Pos","G","GS","Cmp","Att","Yds","Bats","ThAwy","Spikes","Drops","Drop%","BadTh","Bad%","OnTgt","OnTgt%",null,null,"Wide Receiver",null,null,"Running Back",null,null,null,"Tight End",null,null,"Quarterback"]
[2,30,null,null,1,"Patrick Mahomes","KAN",27,"QB",17,17,"2000-03-14",435,648,67.099999999999994,5250,41,6.3,12,1.9,272,67,8.1,8.5,12.1,308.8,105.2,77.599999999999994,26,188,3.9,7.51,7.93,4,4,null,1,"Derrick Henry ","TEN",28,"RB",16,16,349,1538,13,65,56,4.4000000000000004,96.1,6,null,2,"Tyreek Hill","MIA",28,"WR",17,17,170,119,0.7,1710,14.4,7,77,64,10.1,7,100.6,1,null,1,"Patrick Mahomes","KAN",27,"QB",17,17,435,648,5250,8,33,0,33,5.3999999999999999E-2,95,0.154,474,0.77100000000000002,null,null,"Targets","Tier",null,"Carries","Targets","Tier",null,"Targets","Tier",null,"Carries","Pass Att","Tier"]
[2.5,30,null,null,2,"Justin Herbert","LAC",24,"QB",17,17,"2000-07-10",477,699,68.2,4739,25,3.6,10,1.4,228,55,6.8,6.9,9.9,278.8,93.2,58.2,38,206,5.2,6.15,6.22,4,5,null,2,"Josh Jacobs","LVR",24,"RB",17,17,340,1653,12,93,86,4.9000000000000004,97.2,3,null,3,"Travis Kelce","KAN",33,"TE",17,17,152,110,0.72399999999999998,1338,12.2,12,78,52,8.8000000000000007,6.5,78.7,1,null,2,"Justin Herbert","LAC",24,"QB",17,17,477,699,4739,23,25,2,39,5.8000000000000003E-2,87,0.129,508,0.75600000000000001,null,null,150,"Elite WR",null,300,0,"Elite RB",null,100,"Top TE",null,100,0,"Top QB"]
[3,30,null,null,3,"Tom Brady","TAM",45,"QB",17,17,"2000-09-08",490,733,66.8,4694,25,3.4,9,1.2,237,63,6.4,6.5,9.6,276.10000000000002,90.7,52.5,22,160,2.9,6.01,6.13,4,5,null,3,"Nick Chubb","CLE",27,"RB",17,17,302,1525,12,69,41,5,89.7,1,null,4,"Stefon Diggs","BUF",29,"WR",16,16,154,108,0.70099999999999996,1429,13.2,11,74,53,9.3000000000000007,6.8,89.3,1,null,3,"Tom Brady","TAM",45,"QB",17,17,490,733,4694,11,22,4,32,4.4999999999999998E-2,116,0.16400000000000001,545,0.77100000000000002,null,null,130,"2nd Tier WR1",null,200,100,"Elite RB",null,80,"2nd Tier TE1",null,500,50,"Top QB"]
[3.5,30,null,null,4,"Kirk Cousins","MIN",34,"QB",17,17,"2000-04-13",424,643,65.900000000000006,4547,29,4.5,14,2.2000000000000002,230,66,7.1,7,10.7,267.5,92.5,49.9,46,329,6.7,6.12,6.05,8,8,null,4,"Saquon Barkley","NYG",25,"RB",16,16,295,1312,10,62,68,4.4000000000000004,82,1,null,5,"Austin Ekeler","LAC",27,"RB",17,17,127,107,0.84299999999999997,722,6.7,5,36,23,5.7,6.3,42.5,5,null,4,"Kirk Cousins","MIN",34,"QB",17,17,424,643,4547,14,27,3,25,4.1000000000000002E-2,93,0.152,469,0.76500000000000001,null,null,110,"Consistent WR2",null,250,60,"Elite RB",null,null,null,null,500,0,"2nd Tier QB1"]
[4,30,null,null,5,"Joe Burrow","CIN",26,"QB",16,16,"2000-04-12",414,606,68.3,4475,35,5.8,12,2,222,60,7.4,7.6,10.8,279.7,100.8,58.7,41,259,6.3,6.52,6.76,3,4,null,5,"Najee Harris","PIT",24,"RB",17,17,272,1034,7,45,36,3.8,60.8,3,null,6,"CeeDee Lamb","DAL",23,"WR",17,17,156,107,0.68600000000000005,1359,12.7,9,67,39,8.6999999999999993,6.3,79.900000000000006,0,null,5,"Joe Burrow","CIN",26,"QB",16,16,414,606,4475,24,17,1,34,5.8000000000000003E-2,76,0.129,465,0.79100000000000004,null,null,null,null,null,200,60,"2nd Tier RB1"]
{"$rows_left_out":518}