{"text_format":"1","workbook":"xlsx","n_sheets":9,"sheets":["Settings & Instructions","Total Projections (excl QB)","QB Projections","Total Rankings (excl QB)","QB Rankings","Positional Ranks","To Hide","Arizona Cardinals","INPUTS"],"not_rendered":{"charts":0,"images":6,"macros":1,"external_links":0,"defined_names":2,"comments":1,"pivot_tables":0},"unopened":[],"bounds":{"document_bytes":16777216,"sheet_cells":100000,"rows_first":2000,"rows_last":500,"rows_between":2000,"halvings":0,"cell_chars":16384,"cell_head_chars":4096},"cells_cut":0,"cells_raw":0,"read":"whole","date_system":"1900"}

{"sheet":"Settings & Instructions","index":0,"n_rows":40,"n_cols":27,"rows_kept":40,"cut":false,"hidden":false,"merged":[]}
[null,"Welcome to the Yards Per Fantasy Projections Template! Instructions are below - have fun and hit us up with any questions or issues (admin@yardsperfantasy.com)",null,null,null,null,null,null,null,null,null,null,null,null,null,null,null,null,null,null,null,null,null,null,null,1,"Week 1"]
[null,"Not sure where to start? Check out our article on how to go about your projections",null,null,null,null,null,null,null,null,null,null,null,null,null,null,null,null,null,null,null,null,null,null,null,2,"Week 2"]
[null,"When you've finished, export your rankings and don't forget to tag us on Twitter",null,null,null,null,null,null,null,null,null,null,null,null,null,null,null,null,null,null,null,null,null,null,null,3,"Week 3"]
[null,null,null,null,null,null,null,null,null,null,null,null,null,null,null,null,null,null,null,null,null,null,null,null,null,4,"Week 4"]
["League Settings",null,"{Manual Entry - update to match your individual settings}",null,null,null,null,null,null,null,null,null,null,null,null,null,null,null,null,null,null,null,null,null,null,5,"Week 5"]
[null,null,"Value","SFB 12 Settings",null,null,null,null,null,null,null,null,null,null,null,null,null,null,null,null,null,null,null,null,null,6,"Week 6"]
[null,"QB Passing TDs",4,6,null,null,null,null,null,null,null,null,null,null,null,null,null,null,null,null,null,null,null,null,null,7,"Week 7"]
[null,"QB Passing Yards",{"$f":"1/25","v":0.04},0.04,null,null,null,null,null,null,null,null,null,null,null,null,null,null,null,null,null,null,null,null,null,8,"Week 8"]
[null,"Interceptions",-2,-4,null,null,null,null,null,null,null,null,null,null,null,null,null,null,null,null,null,null,null,null,null,9,"Week 9"]
[null,"QB Completions",0,0.5]
[null,"QB Incompletions",0,-1]
[null,"Rushing TD",6,6,null,null,null,null,null,null,null,null,null,null,null,null,null,null,null,null,null,null,null,null,null,10,"Week 10"]
[null,"Receptions",1,0.5,null,null,null,null,null,null,null,null,null,null,null,null,null,null,null,null,null,null,null,null,null,11,"Week 11"]
[null,"Premium - Tight End",1,0.5,null,null,null,null,null,null,null,null,null,null,null,null,null,null,null,null,null,null,null,null,null,12,"Week 12"]
[null,"Premium - Wide Receiver",0,0,null,null,null,null,null,null,null,null,null,null,null,null,null,null,null,null,null,null,null,null,null,13,"Week 13"]
[null,"Premium - Running Back",0,0,null,null,null,null,null,null,null,null,null,null,null,null,null,null,null,null,null,null,null,null,null,14,"Week 14"]
[null,"Rushing Yards",0.1,0.1,null,null,null,null,null,null,null,null,null,null,null,null,null,null,null,null,null,null,null,null,null,15,"Week 15"]
[null,"Receiving Yards",0.1,0.1,null,null,null,null,null,null,null,null,null,null,null,null,null,null,null,null,null,null,null,null,null,16,"Week 16"]
[null,"Receiving TDs",6,6,null,null,null,null,null,null,null,null,null,null,null,null,null,null,null,null,null,null,null,null,null,17,"Week 17"]
[null,"First Downs - Rushing",0,0.5]
[null,"First Downs - Receiving",0,0.5]
[null,"First Downs - Receiving (Tight End Premium)",0,0.5]
[null,null,null,null,null,null,null,null,null,null,null,null,null,null,null,null,null,null,null,null,null,null,null,null,null,18,"Week 18"]
["Instructions",null,"*If this file runs slow, go to the Formulas menu / Calculation Options and set to 'Manual'. When you've finished updating, put it back to 'Automatic' and 'Calculate Now' or Press F9"]
[]
[1,"Update the above league settings with the settings that you want to project. Note: Receptions is used for PPR scoring and should be 0 if non-PPR"]
[2,"For the \"Premium\" settings, add the additional reception premium for that position. For example, if it's 1 point PPR scoring and 2 point PPR for Tight Ends, add an additional 1 to the Tight End position above"]
[3,"For each team, populate the Manual Entry cells. Refer to the 'Steps' guidance for help on how to get going"]
[4,"Start with the Team Projection box to project total play volume and passing %. Note: If you want to do weekly projections, just overwrite the Full Season plays with the weekly numbers you want"]
[5,"Insert the players and their positions (excl Quarterbacks) and all other Manual Entry Cells (target share, catch %, yards per reception, etc)"]
[6,"Note: 2022 Data is shown underneath to help with the process and there's a quick reference player selection right underneath each position group"]
[7,"Note: Target Share % and Rush Share % should each add up to 100%. If they don't, you will see an Error comment at the top"]
[8,"Once the skill position players have been completed, most of the Quarterback stats will auto-populate. Now update the Manual Entry elements for the Quarterbacks"]
[9,"If Calculations are turned to Manual (recommended), press F9 at any time to calculate"]
[10,"When each team is completed, you will see the players and their projections listed under Total Projections and QB Projections"]
[11,"On these tabs, you can sort by position, fantasy points or whatever other stat you want to sort by"]
[12,"The Total Rankings (excl QB), QB Rankings and Positional Rankings tabs will automatically rank each player"]
[13,"Manually add your Tiers to each position if you want to use it for drafting"]
[14,"Go to the Top 12 Export page, select the rankings you want to see and click 'run' to see your top 12 projected players - take the image and post it wherever you want to plant your flag!"]
[null,"Note: You'll to Enable Content for the top 12 export to work"]

{"sheet":"Total Projections (excl QB)","index":1,"n_rows":514,"n_cols":19,"rows_kept":514,"cut":false,"hidden":false,"merged":[]}
["Total Projections (Excl QB)"]
["Rank","Team","Position","Player","Targets","Catch %","Receptions","Premium","1st Downs Rush (Calculated)","1st Downs Rec (Calculated)","Yards per Reception","Receiving Yards","Receiving TDs","Rush Att","Yards per Carry","Rushing Yards","Rushing TDs","Fantasy Points (Excl 1st downs)","Fantasy Points (incl 1st downs)"]
[{"$f":"RANK(S3,$S:$S,0)+COUNTIF($S$3:S3,S3)-1","v":1},"Arizona Cardinals","Running Back",{"$f":"'Arizona Cardinals'!$B$127","v":"James Conner"},{"$f":"'Arizona Cardinals'!$D$127","v":50.591999999999999},{"$f":"'Arizona Cardinals'!$E$127","v":0.75},{"$f":"'Arizona Cardinals'!$F$127","v":37.944000000000003},{"$f":"'Arizona Cardinals'!$O$127","v":0},{"$f":"IF(((0.0572*P3)-2.646)<0,0,(0.0572*P3)-2.646)","v":40.761936000000006},{"$f":"IF(G3=0,0,(0.0461*L3)+2.0516)","v":13.421519600000002},{"$f":"'Arizona Cardinals'!$G$127","v":6.5},{"$f":"'Arizona Cardinals'!$H$127","v":246.63600000000002},{"$f":"'Arizona Cardinals'!$I$127","v":1},{"$f":"'Arizona Cardinals'!$K$127","v":189.72000000000003},{"$f":"'Arizona Cardinals'!$L$127","v":4},{"$f":"'Arizona Cardinals'!$M$127","v":758.88000000000011},{"$f":"'Arizona Cardinals'!$N$127","v":6},{"$f":"'Arizona Cardinals'!$P$127","v":180.49560000000002},{"$f":"IF(R3=0,0,(R3+(I3*'Settings & Instructions'!$C$20)+(J3*'Settings & Instructions'!$C$21)+IF(C3=\"Tight End\",J3*'Settings & Instructions'!$C$22,0)))","v":180.49560000000002}]
[{"$f":"RANK(S4,$S:$S,0)+COUNTIF($S$3:S4,S4)-1","v":8},"Arizona Cardinals","Running Back",{"$f":"'Arizona Cardinals'!$B$128","v":"Corey Clement"},{"$f":"'Arizona Cardinals'!$D$128","v":18.971999999999998},{"$f":"'Arizona Cardinals'!$E$128","v":0.7},{"$f":"'Arizona Cardinals'!$F$128","v":13.280399999999998},{"$f":"'Arizona Cardinals'!$O$128","v":0},{"$f":"IF(((0.0572*P4)-2.646)<0,0,(0.0572*P4)-2.646)","v":11.823312000000001},{"$f":"IF(G4=0,0,(0.0461*L4)+2.0516)","v":5.7249586399999997},{"$f":"'Arizona Cardinals'!$G$128","v":6},{"$f":"'Arizona Cardinals'!$H$128","v":79.682399999999987},{"$f":"'Arizona Cardinals'!$I$128","v":0},{"$f":"'Arizona Cardinals'!$K$128","v":63.240000000000009},{"$f":"'Arizona Cardinals'!$L$128","v":4},{"$f":"'Arizona Cardinals'!$M$128","v":252.96000000000004},{"$f":"'Arizona Cardinals'!$N$128","v":2},{"$f":"'Arizona Cardinals'!$P$128","v":58.544640000000001},{"$f":"IF(R4=0,0,(R4+(I4*'Settings & Instructions'!$C$20)+(J4*'Settings & Instructions'!$C$21)+IF(C4=\"Tight End\",J4*'Settings & Instructions'!$C$22,0)))","v":58.544640000000001}]
[{"$f":"RANK(S5,$S:$S,0)+COUNTIF($S$3:S5,S5)-1","v":7},"Arizona Cardinals","Running Back",{"$f":"'Arizona Cardinals'!$B$129","v":"Keaontay Ingram"},{"$f":"'Arizona Cardinals'!$D$129","v":18.971999999999998},{"$f":"'Arizona Cardinals'!$E$129","v":0.75},{"$f":"'Arizona Cardinals'!$F$129","v":14.228999999999999},{"$f":"'Arizona Cardinals'!$O$129","v":0},{"$f":"IF(((0.0572*P5)-2.646)<0,0,(0.0572*P5)-2.646)","v":11.823312000000001},6.3153198499999998,{"$f":"'Arizona Cardinals'!$G$129","v":6.5},{"$f":"'Arizona Cardinals'!$H$129","v":92.488499999999988},{"$f":"'Arizona Cardinals'!$I$129","v":0},{"$f":"'Arizona Cardinals'!$K$129","v":63.240000000000009},{"$f":"'Arizona Cardinals'!$L$129","v":4},{"$f":"'Arizona Cardinals'!$M$129","v":252.96000000000004},{"$f":"'Arizona Cardinals'!$N$129","v":2},{"$f":"'Arizona Cardinals'!$P$129","v":60.773850000000003},{"$f":"IF(R5=0,0,(R5+(I5*'Settings & Instructions'!$C$20)+(J5*'Settings & Instructions'!$C$21)+IF(C5=\"Tight End\",J5*'Settings & Instructions'!$C$22,0)))","v":60.773850000000003}]
[{"$f":"RANK(S6,$S:$S,0)+COUNTIF($S$3:S6,S6)-1","v":12},"Arizona Cardinals","Running Back",{"$f":"'Arizona Cardinals'!$B$130","v":0},{"$f":"'Arizona Cardinals'!$D$130","v":0},{"$f":"'Arizona Cardinals'!$E$130","v":0},{"$f":"'Arizona Cardinals'!$F$130","v":0},{"$f":"'Arizona Cardinals'!$O$130","v":0},{"$f":"IF(((0.0572*P6)-2.646)<0,0,(0.0572*P6)-2.646)","v":0},0,{"$f":"'Arizona Cardinals'!$G$130","v":0},{"$f":"'Arizona Cardinals'!$H$130","v":0},{"$f":"'Arizona Cardinals'!$I$130","v":0},{"$f":"'Arizona Cardinals'!$K$130","v":0},{"$f":"'Arizona Cardinals'!$L$130","v":0},{"$f":"'Arizona Cardinals'!$M$130","v":0},{"$f":"'Arizona Cardinals'!$N$130","v":0},{"$f":"'Arizona Cardinals'!$P$130","v":0},{"$f":"IF(R6=0,0,(R6+(I6*'Settings & Instructions'!$C$20)+(J6*'Settings & Instructions'!$C$21)+IF(C6=\"Tight End\",J6*'Settings & Instructions'!$C$22,0)))","v":0}]
[{"$f":"RANK(S7,$S:$S,0)+COUNTIF($S$3:S7,S7)-1","v":3},"Arizona Cardinals","Wide Receiver",{"$f":"'Arizona Cardinals'!$B$108","v":"Marquise Brown"},{"$f":"'Arizona Cardinals'!$D$108","v":113.83199999999999},{"$f":"'Arizona Cardinals'!$E$108","v":0.63},{"$f":"'Arizona Cardinals'!$F$108","v":71.714159999999993},{"$f":"'Arizona Cardinals'!$O$108","v":0},{"$f":"IF(((0.0572*P7)-2.646)<0,0,(0.0572*P7)-2.646)","v":0},{"$f":"IF(G7=0,0,(0.0461*L7)+2.0516)","v":35.111827759999997},{"$f":"'Arizona Cardinals'!$G$108","v":10},{"$f":"'Arizona Cardinals'!$H$108","v":717.14159999999993},{"$f":"'Arizona Cardinals'!$I$108","v":3},{"$f":"'Arizona Cardinals'!$K$108","v":0},{"$f":"'Arizona Cardinals'!$L$108","v":0},{"$f":"'Arizona Cardinals'!$M$108","v":0},{"$f":"'Arizona Cardinals'!$N$108","v":0},{"$f":"'Arizona Cardinals'!$P$108","v":161.42831999999999},{"$f":"IF(R7=0,0,(R7+(I7*'Settings & Instructions'!$C$20)+(J7*'Settings & Instructions'!$C$21)+IF(C7=\"Tight End\",J7*'Settings & Instructions'!$C$22,0)))","v":161.42831999999999}]
[{"$f":"RANK(S8,$S:$S,0)+COUNTIF($S$3:S8,S8)-1","v":4},"Arizona Cardinals","Wide Receiver",{"$f":"'Arizona Cardinals'!$B$109","v":"DeAndre Hopkins"},{"$f":"'Arizona Cardinals'!$D$109","v":113.83199999999999},{"$f":"'Arizona Cardinals'!$E$109","v":0.6},{"$f":"'Arizona Cardinals'!$F$109","v":68.299199999999999},{"$f":"'Arizona Cardinals'!$O$109","v":0},{"$f":"IF(((0.0572*P8)-2.646)<0,0,(0.0572*P8)-2.646)","v":0},{"$f":"IF(G8=0,0,(0.0461*L8)+2.0516)","v":31.963234640000003},{"$f":"'Arizona Cardinals'!$G$109","v":9.5},{"$f":"'Arizona Cardinals'!$H$109","v":648.8424},{"$f":"'Arizona Cardinals'!$I$109","v":4},{"$f":"'Arizona Cardinals'!$K$109","v":0},{"$f":"'Arizona Cardinals'!$L$109","v":0},{"$f":"'Arizona Cardinals'!$M$109","v":0},{"$f":"'Arizona Cardinals'!$N$109","v":0},{"$f":"'Arizona Cardinals'!$P$109","v":157.18344000000002},{"$f":"IF(R8=0,0,(R8+(I8*'Settings & Instructions'!$C$20)+(J8*'Settings & Instructions'!$C$21)+IF(C8=\"Tight End\",J8*'Settings & Instructions'!$C$22,0)))","v":157.18344000000002}]
[{"$f":"RANK(S9,$S:$S,0)+COUNTIF($S$3:S9,S9)-1","v":9},"Arizona Cardinals","Wide Receiver",{"$f":"'Arizona Cardinals'!$B$110","v":"Greg Dortch"},{"$f":"'Arizona Cardinals'!$D$110","v":44.268000000000001},{"$f":"'Arizona Cardinals'!$E$110","v":0.65},{"$f":"'Arizona Cardinals'!$F$110","v":28.7742},{"$f":"'Arizona Cardinals'!$O$110","v":0},0,12.663524960000002,{"$f":"'Arizona Cardinals'!$G$110","v":8},{"$f":"'Arizona Cardinals'!$H$110","v":230.1936},{"$f":"'Arizona Cardinals'!$I$110","v":1},{"$f":"'Arizona Cardinals'!$K$110","v":0},{"$f":"'Arizona Cardinals'!$L$110","v":0},{"$f":"'Arizona Cardinals'!$M$110","v":0},{"$f":"'Arizona Cardinals'!$N$110","v":0},{"$f":"'Arizona Cardinals'!$P$110","v":57.793559999999999},{"$f":"IF(R9=0,0,(R9+(I9*'Settings & Instructions'!$C$20)+(J9*'Settings & Instructions'!$C$21)+IF(C9=\"Tight End\",J9*'Settings & Instructions'!$C$22,0)))","v":57.793559999999999}]
[{"$f":"RANK(S10,$S:$S,0)+COUNTIF($S$3:S10,S10)-1","v":6},"Arizona Cardinals","Wide Receiver",{"$f":"'Arizona Cardinals'!$B$111","v":"Rondale Moore"},{"$f":"'Arizona Cardinals'!$D$111","v":44.268000000000001},{"$f":"'Arizona Cardinals'!$E$111","v":0.7},{"$f":"'Arizona Cardinals'!$F$111","v":30.987599999999997},{"$f":"'Arizona Cardinals'!$O$111","v":0},0,16.3368836,{"$f":"'Arizona Cardinals'!$G$111","v":10},{"$f":"'Arizona Cardinals'!$H$111","v":309.87599999999998},{"$f":"'Arizona Cardinals'!$I$111","v":1},{"$f":"'Arizona Cardinals'!$K$111","v":0},{"$f":"'Arizona Cardinals'!$L$111","v":0},{"$f":"'Arizona Cardinals'!$M$111","v":0},{"$f":"'Arizona Cardinals'!$N$111","v":0},{"$f":"'Arizona Cardinals'!$P$111","v":67.975200000000001},{"$f":"IF(R10=0,0,(R10+(I10*'Settings & Instructions'!$C$20)+(J10*'Settings & Instructions'!$C$21)+IF(C10=\"Tight End\",J10*'Settings & Instructions'!$C$22,0)))","v":67.975200000000001}]
[{"$f":"RANK(S11,$S:$S,0)+COUNTIF($S$3:S11,S11)-1","v":10},"Arizona Cardinals","Wide Receiver",{"$f":"'Arizona Cardinals'!$B$112","v":"Zach Pascal"},{"$f":"'Arizona Cardinals'!$D$112","v":18.971999999999998},{"$f":"'Arizona Cardinals'!$E$112","v":0.6},{"$f":"'Arizona Cardinals'!$F$112","v":11.383199999999999},{"$f":"'Arizona Cardinals'!$O$112","v":0},0,6.7744896800000003,{"$f":"'Arizona Cardinals'!$G$112","v":9},{"$f":"'Arizona Cardinals'!$H$112","v":102.44879999999999},{"$f":"'Arizona Cardinals'!$I$112","v":1},{"$f":"'Arizona Cardinals'!$K$112","v":0},{"$f":"'Arizona Cardinals'!$L$112","v":0},{"$f":"'Arizona Cardinals'!$M$112","v":0},{"$f":"'Arizona Cardinals'!$N$112","v":0},{"$f":"'Arizona Cardinals'!$P$112","v":27.628079999999997},{"$f":"IF(R11=0,0,(R11+(I11*'Settings & Instructions'!$C$20)+(J11*'Settings & Instructions'!$C$21)+IF(C11=\"Tight End\",J11*'Settings & Instructions'!$C$22,0)))","v":27.628079999999997}]
[{"$f":"RANK(S12,$S:$S,0)+COUNTIF($S$3:S12,S12)-1","v":11},"Arizona Cardinals","Wide Receiver",{"$f":"'Arizona Cardinals'!$B$113","v":"Michael Wilson"},{"$f":"'Arizona Cardinals'!$D$113","v":12.648},{"$f":"'Arizona Cardinals'!$E$113","v":0.62},{"$f":"'Arizona Cardinals'!$F$113","v":7.8417599999999998},{"$f":"'Arizona Cardinals'!$O$113","v":0},0,5.6666513599999995,{"$f":"'Arizona Cardinals'!$G$113","v":10},{"$f":"'Arizona Cardinals'!$H$113","v":78.417599999999993},{"$f":"'Arizona Cardinals'!$I$113","v":1},{"$f":"'Arizona Cardinals'!$K$113","v":0},{"$f":"'Arizona Cardinals'!$L$113","v":0},{"$f":"'Arizona Cardinals'!$M$113","v":0},{"$f":"'Arizona Cardinals'!$N$113","v":0},{"$f":"'Arizona Cardinals'!$P$113","v":21.683520000000001},{"$f":"IF(R12=0,0,(R12+(I12*'Settings & Instructions'!$C$20)+(J12*'Settings & Instructions'!$C$21)+IF(C12=\"Tight End\",J12*'Settings & Instructions'!$C$22,0)))","v":21.683520000000001}]
[{"$f":"RANK(S13,$S:$S,0)+COUNTIF($S$3:S13,S13)-1","v":13},"Arizona Cardinals","Wide Receiver",{"$f":"'Arizona Cardinals'!$B$114","v":0},{"$f":"'Arizona Cardinals'!$D$114","v":0},{"$f":"'Arizona Cardinals'!$E$114","v":0},{"$f":"'Arizona Cardinals'!$F$114","v":0},{"$f":"'Arizona Cardinals'!$O$114","v":0},0,0,{"$f":"'Arizona Cardinals'!$G$114","v":0},{"$f":"'Arizona Cardinals'!$H$114","v":0},{"$f":"'Arizona Cardinals'!$I$114","v":0},{"$f":"'Arizona Cardinals'!$K$114","v":0},{"$f":"'Arizona Cardinals'!$L$114","v":0},{"$f":"'Arizona Cardinals'!$M$114","v":0},{"$f":"'Arizona Cardinals'!$N$114","v":0},{"$f":"'Arizona Cardinals'!$P$114","v":0},{"$f":"IF(R13=0,0,(R13+(I13*'Settings & Instructions'!$C$20)+(J13*'Settings & Instructions'!$C$21)+IF(C13=\"Tight End\",J13*'Settings & Instructions'!$C$22,0)))","v":0}]
[{"$f":"RANK(S14,$S:$S,0)+COUNTIF($S$3:S14,S14)-1","v":14},"Arizona Cardinals","Wide Receiver",{"$f":"'Arizona Cardinals'!$B$115","v":0},{"$f":"'Arizona Cardinals'!$D$115","v":0},{"$f":"'Arizona Cardinals'!$E$115","v":0},{"$f":"'Arizona Cardinals'!$F$115","v":0},{"$f":"'Arizona Cardinals'!$O$115","v":0},0,0,{"$f":"'Arizona Cardinals'!$G$115","v":0},{"$f":"'Arizona Cardinals'!$H$115","v":0},{"$f":"'Arizona Cardinals'!$I$115","v":0},{"$f":"'Arizona Cardinals'!$K$115","v":0},{"$f":"'Arizona Cardinals'!$L$115","v":0},{"$f":"'Arizona Cardinals'!$M$115","v":0},{"$f":"'Arizona Cardinals'!$N$115","v":0},{"$f":"'Arizona Cardinals'!$P$115","v":0},{"$f":"IF(R14=0,0,(R14+(I14*'Settings & Instructions'!$C$20)+(J14*'Settings & Instructions'!$C$21)+IF(C14=\"Tight End\",J14*'Settings & Instructions'!$C$22,0)))","v":0}]
[{"$f":"RANK(S15,$S:$S,0)+COUNTIF($S$3:S15,S15)-1","v":2},"Arizona Cardinals","Tight End",{"$f":"'Arizona Cardinals'!$B$142","v":"Zach Ertz"},{"$f":"'Arizona Cardinals'!$D$142","v":75.887999999999991},{"$f":"'Arizona Cardinals'!$E$142","v":0.67},{"$f":"'Arizona Cardinals'!$F$142","v":50.84496},{"$f":"'Arizona Cardinals'!$O$142","v":1},0,23.147173904000002,{"$f":"'Arizona Cardinals'!$G$142","v":9},{"$f":"'Arizona Cardinals'!$H$142","v":457.60464000000002},{"$f":"'Arizona Cardinals'!$I$142","v":3},{"$f":"'Arizona Cardinals'!$K$142","v":0},{"$f":"'Arizona Cardinals'!$L$142","v":0},{"$f":"'Arizona Cardinals'!$M$142","v":0},{"$f":"'Arizona Cardinals'!$N$142","v":0},{"$f":"'Arizona Cardinals'!$P$142","v":165.45038399999999},{"$f":"IF(R15=0,0,(R15+(I15*'Settings & Instructions'!$C$20)+(J15*'Settings & Instructions'!$C$21)+IF(C15=\"Tight End\",J15*'Settings & Instructions'!$C$22,0)))","v":165.45038399999999}]
[{"$f":"RANK(S16,$S:$S,0)+COUNTIF($S$3:S16,S16)-1","v":5},"Arizona Cardinals","Tight End",{"$f":"'Arizona Cardinals'!$B$143","v":"Trey McBride"},{"$f":"'Arizona Cardinals'!$D$143","v":56.915999999999997},{"$f":"'Arizona Cardinals'!$E$143","v":0.65},{"$f":"'Arizona Cardinals'!$F$143","v":36.995399999999997},{"$f":"'Arizona Cardinals'!$O$143","v":1},0,{"$f":"IF(G16=0,0,(0.0461*L16)+2.0516)","v":17.40099146},{"$f":"'Arizona Cardinals'!$G$143","v":9},{"$f":"'Arizona Cardinals'!$H$143","v":332.95859999999999},{"$f":"'Arizona Cardinals'!$I$143","v":3},{"$f":"'Arizona Cardinals'!$K$143","v":0},{"$f":"'Arizona Cardinals'!$L$143","v":0},{"$f":"'Arizona Cardinals'!$M$143","v":0},{"$f":"'Arizona Cardinals'!$N$143","v":0},{"$f":"'Arizona Cardinals'!$P$143","v":125.28665999999998},{"$f":"IF(R16=0,0,(R16+(I16*'Settings & Instructions'!$C$20)+(J16*'Settings & Instructions'!$C$21)+IF(C16=\"Tight End\",J16*'Settings & Instructions'!$C$22,0)))","v":125.28665999999998}]
[{"$f":"RANK(S17,$S:$S,0)+COUNTIF($S$3:S17,S17)-1","v":15},"Arizona Cardinals","Tight End",{"$f":"'Arizona Cardinals'!$B$144","v":0},{"$f":"'Arizona Cardinals'!$D$144","v":0},{"$f":"'Arizona Cardinals'!$E$144","v":0},{"$f":"'Arizona Cardinals'!$F$144","v":0},{"$f":"'Arizona Cardinals'!$O$144","v":1},0,0,{"$f":"'Arizona Cardinals'!$G$144","v":0},{"$f":"'Arizona Cardinals'!$H$144","v":0},{"$f":"'Arizona Cardinals'!$I$144","v":0},{"$f":"'Arizona Cardinals'!$K$144","v":0},{"$f":"'Arizona Cardinals'!$L$144","v":0},{"$f":"'Arizona Cardinals'!$M$144","v":0},{"$f":"'Arizona Cardinals'!$N$144","v":0},{"$f":"'Arizona Cardinals'!$P$144","v":0},{"$f":"IF(R17=0,0,(R17+(I17*'Settings & Instructions'!$C$20)+(J17*'Settings & Instructions'!$C$21)+IF(C17=\"Tight End\",J17*'Settings & Instructions'!$C$22,0)))","v":0}]
[{"$f":"RANK(S18,$S:$S,0)+COUNTIF($S$3:S18,S18)-1","v":16},"Arizona Cardinals","Tight End",{"$f":"'Arizona Cardinals'!$B$145","v":0},{"$f":"'Arizona Cardinals'!$D$145","v":0},{"$f":"'Arizona Cardinals'!$E$145","v":0},{"$f":"'Arizona Cardinals'!$F$145","v":0},{"$f":"'Arizona Cardinals'!$O$145","v":1},0,0,{"$f":"'Arizona Cardinals'!$G$145","v":0},{"$f":"'Arizona Cardinals'!$H$145","v":0},{"$f":"'Arizona Cardinals'!$I$145","v":0},{"$f":"'Arizona Cardinals'!$K$145","v":0},{"$f":"'Arizona Cardinals'!$L$145","v":0},{"$f":"'Arizona Cardinals'!$M$145","v":0},{"$f":"'Arizona Cardinals'!$N$145","v":0},{"$f":"'Arizona Cardinals'!$P$145","v":0},{"$f":"IF(R18=0,0,(R18+(I18*'Settings & Instructions'!$C$20)+(J18*'Settings & Instructions'!$C$21)+IF(C18=\"Tight End\",J18*'Settings & Instructions'!$C$22,0)))","v":0}]
[{"$f":"RANK(S19,$S:$S,0)+COUNTIF($S$3:S19,S19)-1","v":16},"Atlanta Falcons","Running Back"]
[{"$f":"RANK(S20,$S:$S,0)+COUNTIF($S$3:S20,S20)-1","v":16},"Atlanta Falcons","Running Back"]
[{"$f":"RANK(S21,$S:$S,0)+COUNTIF($S$3:S21,S21)-1","v":16},"Atlanta Falcons","Running Back"]
[{"$f":"RANK(S22,$S:$S,0)+COUNTIF($S$3:S22,S22)-1","v":16},"Atlanta Falcons","Running Back"]
[{"$f":"RANK(S23,$S:$S,0)+COUNTIF($S$3:S23,S23)-1","v":16},"Atlanta Falcons","Wide Receiver"]
[{"$f":"RANK(S24,$S:$S,0)+COUNTIF($S$3:S24,S24)-1","v":16},"Atlanta Falcons","Wide Receiver"]
[{"$f":"RANK(S25,$S:$S,0)+COUNTIF($S$3:S25,S25)-1","v":16},"Atlanta Falcons","Wide Receiver"]
[{"$f":"RANK(S26,$S:$S,0)+COUNTIF($S$3:S26,S26)-1","v":16},"Atlanta Falcons","Wide Receiver"]
[{"$f":"RANK(S27,$S:$S,0)+COUNTIF($S$3:S27,S27)-1","v":16},"Atlanta Falcons","Wide Receiver"]
[{"$f":"RANK(S28,$S:$S,0)+COUNTIF($S$3:S28,S28)-1","v":16},"Atlanta Falcons","Wide Receiver"]
[{"$f":"RANK(S29,$S:$S,0)+COUNTIF($S$3:S29,S29)-1","v":16},"Atlanta Falcons","Wide Receiver"]
[{"$f":"RANK(S30,$S:$S,0)+COUNTIF($S$3:S30,S30)-1","v":16},"Atlanta Falcons","Wide Receiver"]
[{"$f":"RANK(S31,$S:$S,0)+COUNTIF($S$3:S31,S31)-1","v":16},"Atlanta Falcons","Tight End"]
[{"$f":"RANK(S32,$S:$S,0)+COUNTIF($S$3:S32,S32)-1","v":16},"Atlanta Falcons","Tight End"]
[{"$f":"RANK(S33,$S:$S,0)+COUNTIF($S$3:S33,S33)-1","v":16},"Atlanta Falcons","Tight End"]
[{"$f":"RANK(S34,$S:$S,0)+COUNTIF($S$3:S34,S34)-1","v":16},"Atlanta Falcons","Tight End"]
[{"$f":"RANK(S35,$S:$S,0)+COUNTIF($S$3:S35,S35)-1","v":16},"Baltimore Ravens","Running Back"]
[{"$f":"RANK(S36,$S:$S,0)+COUNTIF($S$3:S36,S36)-1","v":16},"Baltimore Ravens","Running Back"]
[{"$f":"RANK(S37,$S:$S,0)+COUNTIF($S$3:S37,S37)-1","v":16},"Baltimore Ravens","Running Back"]
[{"$f":"RANK(S38,$S:$S,0)+COUNTIF($S$3:S38,S38)-1","v":16},"Baltimore Ravens","Running Back"]
[{"$f":"RANK(S39,$S:$S,0)+COUNTIF($S$3:S39,S39)-1","v":16},"Baltimore Ravens","Wide Receiver"]
[{"$f":"RANK(S40,$S:$S,0)+COUNTIF($S$3:S40,S40)-1","v":16},"Baltimore Ravens","Wide Receiver"]
[{"$f":"RANK(S41,$S:$S,0)+COUNTIF($S$3:S41,S41)-1","v":16},"Baltimore Ravens","Wide Receiver"]
[{"$f":"RANK(S42,$S:$S,0)+COUNTIF($S$3:S42,S42)-1","v":16},"Baltimore Ravens","Wide Receiver"]
[{"$f":"RANK(S43,$S:$S,0)+COUNTIF($S$3:S43,S43)-1","v":16},"Baltimore Ravens","Wide Receiver"]
[{"$f":"RANK(S44,$S:$S,0)+COUNTIF($S$3:S44,S44)-1","v":16},"Baltimore Ravens","Wide Receiver"]
[{"$f":"RANK(S45,$S:$S,0)+COUNTIF($S$3:S45,S45)-1","v":16},"Baltimore Ravens","Wide Receiver"]
[{"$f":"RANK(S46,$S:$S,0)+COUNTIF($S$3:S46,S46)-1","v":16},"Baltimore Ravens","Wide Receiver"]
[{"$f":"RANK(S47,$S:$S,0)+COUNTIF($S$3:S47,S47)-1","v":16},"Baltimore Ravens","Tight End"]
[{"$f":"RANK(S48,$S:$S,0)+COUNTIF($S$3:S48,S48)-1","v":16},"Baltimore Ravens","Tight End"]
[{"$f":"RANK(S49,$S:$S,0)+COUNTIF($S$3:S49,S49)-1","v":16},"Baltimore Ravens","Tight End"]
[{"$f":"RANK(S50,$S:$S,0)+COUNTIF($S$3:S50,S50)-1","v":16},"Baltimore Ravens","Tight End"]
[{"$f":"RANK(S51,$S:$S,0)+COUNTIF($S$3:S51,S51)-1","v":16},"Buffalo Bills","Running Back"]
[{"$f":"RANK(S52,$S:$S,0)+COUNTIF($S$3:S52,S52)-1","v":16},"Buffalo Bills","Running Back"]
[{"$f":"RANK(S53,$S:$S,0)+COUNTIF($S$3:S53,S53)-1","v":16},"Buffalo Bills","Running Back"]
[{"$f":"RANK(S54,$S:$S,0)+COUNTIF($S$3:S54,S54)-1","v":16},"Buffalo Bills","Running Back"]
[{"$f":"RANK(S55,$S:$S,0)+COUNTIF($S$3:S55,S55)-1","v":16},"Buffalo Bills","Wide Receiver"]
[{"$f":"RANK(S56,$S:$S,0)+COUNTIF($S$3:S56,S56)-1","v":16},"Buffalo Bills","Wide Receiver"]
[{"$f":"RANK(S57,$S:$S,0)+COUNTIF($S$3:S57,S57)-1","v":16},"Buffalo Bills","Wide Receiver"]
[{"$f":"RANK(S58,$S:$S,0)+COUNTIF($S$3:S58,S58)-1","v":16},"Buffalo Bills","Wide Receiver"]
[{"$f":"RANK(S59,$S:$S,0)+COUNTIF($S$3:S59,S59)-1","v":16},"Buffalo Bills","Wide Receiver"]
[{"$f":"RANK(S60,$S:$S,0)+COUNTIF($S$3:S60,S60)-1","v":16},"Buffalo Bills","Wide Receiver"]
[{"$f":"RANK(S61,$S:$S,0)+COUNTIF($S$3:S61,S61)-1","v":16},"Buffalo Bills","Wide Receiver"]
[{"$f":"RANK(S62,$S:$S,0)+COUNTIF($S$3:S62,S62)-1","v":16},"Buffalo Bills","Wide Receiver"]
[{"$f":"RANK(S63,$S:$S,0)+COUNTIF($S$3:S63,S63)-1","v":16},"Buffalo Bills","Tight End"]
[{"$f":"RANK(S64,$S:$S,0)+COUNTIF($S$3:S64,S64)-1","v":16},"Buffalo Bills","Tight End"]
[{"$f":"RANK(S65,$S:$S,0)+COUNTIF($S$3:S65,S65)-1","v":16},"Buffalo Bills","Tight End"]
[{"$f":"RANK(S66,$S:$S,0)+COUNTIF($S$3:S66,S66)-1","v":16},"Buffalo Bills","Tight End"]
[{"$f":"RANK(S67,$S:$S,0)+COUNTIF($S$3:S67,S67)-1","v":16},"Carolina Panthers","Running Back"]
[{"$f":"RANK(S68,$S:$S,0)+COUNTIF($S$3:S68,S68)-1","v":16},"Carolina Panthers","Running Back"]
[{"$f":"RANK(S69,$S:$S,0)+COUNTIF($S$3:S69,S69)-1","v":16},"Carolina Panthers","Running Back"]
[{"$f":"RANK(S70,$S:$S,0)+COUNTIF($S$3:S70,S70)-1","v":16},"Carolina Panthers","Running Back"]
[{"$f":"RANK(S71,$S:$S,0)+COUNTIF($S$3:S71,S71)-1","v":16},"Carolina Panthers","Wide Receiver"]
[{"$f":"RANK(S72,$S:$S,0)+COUNTIF($S$3:S72,S72)-1","v":16},"Carolina Panthers","Wide Receiver"]
[{"$f":"RANK(S73,$S:$S,0)+COUNTIF($S$3:S73,S73)-1","v":16},"Carolina Panthers","Wide Receiver"]
[{"$f":"RANK(S74,$S:$S,0)+COUNTIF($S$3:S74,S74)-1","v":16},"Carolina Panthers","Wide Receiver"]
[{"$f":"RANK(S75,$S:$S,0)+COUNTIF($S$3:S75,S75)-1","v":16},"Carolina Panthers","Wide Receiver"]
[{"$f":"RANK(S76,$S:$S,0)+COUNTIF($S$3:S76,S76)-1","v":16},"Carolina Panthers","Wide Receiver"]
[{"$f":"RANK(S77,$S:$S,0)+COUNTIF($S$3:S77,S77)-1","v":16},"Carolina Panthers","Wide Receiver"]
[{"$f":"RANK(S78,$S:$S,0)+COUNTIF($S$3:S78,S78)-1","v":16},"Carolina Panthers","Wide Receiver"]
[{"$f":"RANK(S79,$S:$S,0)+COUNTIF($S$3:S79,S79)-1","v":16},"Carolina Panthers","Tight End"]
[{"$f":"RANK(S80,$S:$S,0)+COUNTIF($S$3:S80,S80)-1","v":16},"Carolina Panthers","Tight End"]
[{"$f":"RANK(S81,$S:$S,0)+COUNTIF($S$3:S81,S81)-1","v":16},"Carolina Panthers","Tight End"]
[{"$f":"RANK(S82,$S:$S,0)+COUNTIF($S$3:S82,S82)-1","v":16},"Carolina Panthers","Tight End"]
[{"$f":"RANK(S83,$S:$S,0)+COUNTIF($S$3:S83,S83)-1","v":16},"Chicago Bears","Running Back"]
[{"$f":"RANK(S84,$S:$S,0)+COUNTIF($S$3:S84,S84)-1","v":16},"Chicago Bears","Running Back"]
[{"$f":"RANK(S85,$S:$S,0)+COUNTIF($S$3:S85,S85)-1","v":16},"Chicago Bears","Running Back"]
[{"$f":"RANK(S86,$S:$S,0)+COUNTIF($S$3:S86,S86)-1","v":16},"Chicago Bears","Running Back"]
[{"$f":"RANK(S87,$S:$S,0)+COUNTIF($S$3:S87,S87)-1","v":16},"Chicago Bears","Wide Receiver"]
[{"$f":"RANK(S88,$S:$S,0)+COUNTIF($S$3:S88,S88)-1","v":16},"Chicago Bears","Wide Receiver"]
[{"$f":"RANK(S89,$S:$S,0)+COUNTIF($S$3:S89,S89)-1","v":16},"Chicago Bears","Wide Receiver"]
[{"$f":"RANK(S90,$S:$S,0)+COUNTIF($S$3:S90,S90)-1","v":16},"Chicago Bears","Wide Receiver"]
[{"$f":"RANK(S91,$S:$S,0)+COUNTIF($S$3:S91,S91)-1","v":16},"Chicago Bears","Wide Receiver"]
[{"$f":"RANK(S92,$S:$S,0)+COUNTIF($S$3:S92,S92)-1","v":16},"Chicago Bears","Wide Receiver"]
[{"$f":"RANK(S93,$S:$S,0)+COUNTIF($S$3:S93,S93)-1","v":16},"Chicago Bears","Wide Receiver"]
[{"$f":"RANK(S94,$S:$S,0)+COUNTIF($S$3:S94,S94)-1","v":16},"Chicago Bears","Wide Receiver"]
[{"$f":"RANK(S95,$S:$S,0)+COUNTIF($S$3:S95,S95)-1","v":16},"Chicago Bears","Tight End"]
[{"$f":"RANK(S96,$S:$S,0)+COUNTIF($S$3:S96,S96)-1","v":16},"Chicago Bears","Tight End"]
[{"$f":"RANK(S97,$S:$S,0)+COUNTIF($S$3:S97,S97)-1","v":16},"Chicago Bears","Tight End"]
[{"$f":"RANK(S98,$S:$S,0)+COUNTIF($S$3:S98,S98)-1","v":16},"Chicago Bears","Tight End"]
[{"$f":"RANK(S99,$S:$S,0)+COUNTIF($S$3:S99,S99)-1","v":16},"Cincinnati Bengals","Running Back"]
[{"$f":"RANK(S100,$S:$S,0)+COUNTIF($S$3:S100,S100)-1","v":16},"Cincinnati Bengals","Running Back"]
[{"$f":"RANK(S101,$S:$S,0)+COUNTIF($S$3:S101,S101)-1","v":16},"Cincinnati Bengals","Running Back"]
[{"$f":"RANK(S102,$S:$S,0)+COUNTIF($S$3:S102,S102)-1","v":16},"Cincinnati Bengals","Running Back"]
[{"$f":"RANK(S103,$S:$S,0)+COUNTIF($S$3:S103,S103)-1","v":16},"Cincinnati Bengals","Wide Receiver"]
[{"$f":"RANK(S104,$S:$S,0)+COUNTIF($S$3:S104,S104)-1","v":16},"Cincinnati Bengals","Wide Receiver"]
[{"$f":"RANK(S105,$S:$S,0)+COUNTIF($S$3:S105,S105)-1","v":16},"Cincinnati Bengals","Wide Receiver"]
[{"$f":"RANK(S106,$S:$S,0)+COUNTIF($S$3:S106,S106)-1","v":16},"Cincinnati Bengals","Wide Receiver"]
[{"$f":"RANK(S107,$S:$S,0)+COUNTIF($S$3:S107,S107)-1","v":16},"Cincinnati Bengals","Wide Receiver"]
[{"$f":"RANK(S108,$S:$S,0)+COUNTIF($S$3:S108,S108)-1","v":16},"Cincinnati Bengals","Wide Receiver"]
[{"$f":"RANK(S109,$S:$S,0)+COUNTIF($S$3:S109,S109)-1","v":16},"Cincinnati Bengals","Wide Receiver"]
[{"$f":"RANK(S110,$S:$S,0)+COUNTIF($S$3:S110,S110)-1","v":16},"Cincinnati Bengals","Wide Receiver"]
[{"$f":"RANK(S111,$S:$S,0)+COUNTIF($S$3:S111,S111)-1","v":16},"Cincinnati Bengals","Tight End"]
[{"$f":"RANK(S112,$S:$S,0)+COUNTIF($S$3:S112,S112)-1","v":16},"Cincinnati Bengals","Tight End"]
[{"$f":"RANK(S113,$S:$S,0)+COUNTIF($S$3:S113,S113)-1","v":16},"Cincinnati Bengals","Tight End"]
[{"$f":"RANK(S114,$S:$S,0)+COUNTIF($S$3:S114,S114)-1","v":16},"Cincinnati Bengals","Tight End"]
[{"$f":"RANK(S115,$S:$S,0)+COUNTIF($S$3:S115,S115)-1","v":16},"Cleveland Browns","Running Back"]
[{"$f":"RANK(S116,$S:$S,0)+COUNTIF($S$3:S116,S116)-1","v":16},"Cleveland Browns","Running Back"]
[{"$f":"RANK(S117,$S:$S,0)+COUNTIF($S$3:S117,S117)-1","v":16},"Cleveland Browns","Running Back"]
[{"$f":"RANK(S118,$S:$S,0)+COUNTIF($S$3:S118,S118)-1","v":16},"Cleveland Browns","Running Back"]
[{"$f":"RANK(S119,$S:$S,0)+COUNTIF($S$3:S119,S119)-1","v":16},"Cleveland Browns","Wide Receiver"]
[{"$f":"RANK(S120,$S:$S,0)+COUNTIF($S$3:S120,S120)-1","v":16},"Cleveland Browns","Wide Receiver"]
[{"$f":"RANK(S121,$S:$S,0)+COUNTIF($S$3:S121,S121)-1","v":16},"Cleveland Browns","Wide Receiver"]
[{"$f":"RANK(S122,$S:$S,0)+COUNTIF($S$3:S122,S122)-1","v":16},"Cleveland Browns","Wide Receiver"]
[{"$f":"RANK(S123,$S:$S,0)+COUNTIF($S$3:S123,S123)-1","v":16},"Cleveland Browns","Wide Receiver"]
[{"$f":"RANK(S124,$S:$S,0)+COUNTIF($S$3:S124,S124)-1","v":16},"Cleveland Browns","Wide Receiver"]
[{"$f":"RANK(S125,$S:$S,0)+COUNTIF($S$3:S125,S125)-1","v":16},"Cleveland Browns","Wide Receiver"]
[{"$f":"RANK(S126,$S:$S,0)+COUNTIF($S$3:S126,S126)-1","v":16},"Cleveland Browns","Wide Receiver"]
[{"$f":"RANK(S127,$S:$S,0)+COUNTIF($S$3:S127,S127)-1","v":16},"Cleveland Browns","Tight End"]
[{"$f":"RANK(S128,$S:$S,0)+COUNTIF($S$3:S128,S128)-1","v":16},"Cleveland Browns","Tight End"]
[{"$f":"RANK(S129,$S:$S,0)+COUNTIF($S$3:S129,S129)-1","v":16},"Cleveland Browns","Tight End"]
[{"$f":"RANK(S130,$S:$S,0)+COUNTIF($S$3:S130,S130)-1","v":16},"Cleveland Browns","Tight End"]
[{"$f":"RANK(S131,$S:$S,0)+COUNTIF($S$3:S131,S131)-1","v":16},"Dallas Cowboys","Running Back"]
[{"$f":"RANK(S132,$S:$S,0)+COUNTIF($S$3:S132,S132)-1","v":16},"Dallas Cowboys","Running Back"]
[{"$f":"RANK(S133,$S:$S,0)+COUNTIF($S$3:S133,S133)-1","v":16},"Dallas Cowboys","Running Back"]
[{"$f":"RANK(S134,$S:$S,0)+COUNTIF($S$3:S134,S134)-1","v":16},"Dallas Cowboys","Running Back"]
[{"$f":"RANK(S135,$S:$S,0)+COUNTIF($S$3:S135,S135)-1","v":16},"Dallas Cowboys","Wide Receiver"]
[{"$f":"RANK(S136,$S:$S,0)+COUNTIF($S$3:S136,S136)-1","v":16},"Dallas Cowboys","Wide Receiver"]
[{"$f":"RANK(S137,$S:$S,0)+COUNTIF($S$3:S137,S137)-1","v":16},"Dallas Cowboys","Wide Receiver"]
[{"$f":"RANK(S138,$S:$S,0)+COUNTIF($S$3:S138,S138)-1","v":16},"Dallas Cowboys","Wide Receiver"]
[{"$f":"RANK(S139,$S:$S,0)+COUNTIF($S$3:S139,S139)-1","v":16},"Dallas Cowboys","Wide Receiver"]
[{"$f":"RANK(S140,$S:$S,0)+COUNTIF($S$3:S140,S140)-1","v":16},"Dallas Cowboys","Wide Receiver"]
[{"$f":"RANK(S141,$S:$S,0)+COUNTIF($S$3:S141,S141)-1","v":16},"Dallas Cowboys","Wide Receiver"]
[{"$f":"RANK(S142,$S:$S,0)+COUNTIF($S$3:S142,S142)-1","v":16},"Dallas Cowboys","Wide Receiver"]
[{"$f":"RANK(S143,$S:$S,0)+COUNTIF($S$3:S143,S143)-1","v":16},"Dallas Cowboys","Tight End"]
[{"$f":"RANK(S144,$S:$S,0)+COUNTIF($S$3:S144,S144)-1","v":16},"Dallas Cowboys","Tight End"]
[{"$f":"RANK(S145,$S:$S,0)+COUNTIF($S$3:S145,S145)-1","v":16},"Dallas Cowboys","Tight End"]
[{"$f":"RANK(S146,$S:$S,0)+COUNTIF($S$3:S146,S146)-1","v":16},"Dallas Cowboys","Tight End"]
[{"$f":"RANK(S147,$S:$S,0)+COUNTIF($S$3:S147,S147)-1","v":16},"Denver Broncos","Running Back"]
[{"$f":"RANK(S148,$S:$S,0)+COUNTIF($S$3:S148,S148)-1","v":16},"Denver Broncos","Running Back"]
[{"$f":"RANK(S149,$S:$S,0)+COUNTIF($S$3:S149,S149)-1","v":16},"Denver Broncos","Running Back"]
[{"$f":"RANK(S150,$S:$S,0)+COUNTIF($S$3:S150,S150)-1","v":16},"Denver Broncos","Running Back"]
[{"$f":"RANK(S151,$S:$S,0)+COUNTIF($S$3:S151,S151)-1","v":16},"Denver Broncos","Wide Receiver"]
[{"$f":"RANK(S152,$S:$S,0)+COUNTIF($S$3:S152,S152)-1","v":16},"Denver Broncos","Wide Receiver"]
[{"$f":"RANK(S153,$S:$S,0)+COUNTIF($S$3:S153,S153)-1","v":16},"Denver Broncos","Wide Receiver"]
[{"$f":"RANK(S154,$S:$S,0)+COUNTIF($S$3:S154,S154)-1","v":16},"Denver Broncos","Wide Receiver"]
[{"$f":"RANK(S155,$S:$S,0)+COUNTIF($S$3:S155,S155)-1","v":16},"Denver Broncos","Wide Receiver"]
[{"$f":"RANK(S156,$S:$S,0)+COUNTIF($S$3:S156,S156)-1","v":16},"Denver Broncos","Wide Receiver"]
[{"$f":"RANK(S157,$S:$S,0)+COUNTIF($S$3:S157,S157)-1","v":16},"Denver Broncos","Wide Receiver"]
[{"$f":"RANK(S158,$S:$S,0)+COUNTIF($S$3:S158,S158)-1","v":16},"Denver Broncos","Wide Receiver"]
[{"$f":"RANK(S159,$S:$S,0)+COUNTIF($S$3:S159,S159)-1","v":16},"Denver Broncos","Tight End"]
[{"$f":"RANK(S160,$S:$S,0)+COUNTIF($S$3:S160,S160)-1","v":16},"Denver Broncos","Tight End"]
[{"$f":"RANK(S161,$S:$S,0)+COUNTIF($S$3:S161,S161)-1","v":16},"Denver Broncos","Tight End"]
[{"$f":"RANK(S162,$S:$S,0)+COUNTIF($S$3:S162,S162)-1","v":16},"Denver Broncos","Tight End"]
[{"$f":"RANK(S163,$S:$S,0)+COUNTIF($S$3:S163,S163)-1","v":16},"Detroit Lions","Running Back"]
[{"$f":"RANK(S164,$S:$S,0)+COUNTIF($S$3:S164,S164)-1","v":16},"Detroit Lions","Running Back"]
[{"$f":"RANK(S165,$S:$S,0)+COUNTIF($S$3:S165,S165)-1","v":16},"Detroit Lions","Running Back"]
[{"$f":"RANK(S166,$S:$S,0)+COUNTIF($S$3:S166,S166)-1","v":16},"Detroit Lions","Running Back"]
[{"$f":"RANK(S167,$S:$S,0)+COUNTIF($S$3:S167,S167)-1","v":16},"Detroit Lions","Wide Receiver"]
[{"$f":"RANK(S168,$S:$S,0)+COUNTIF($S$3:S168,S168)-1","v":16},"Detroit Lions","Wide Receiver"]
[{"$f":"RANK(S169,$S:$S,0)+COUNTIF($S$3:S169,S169)-1","v":16},"Detroit Lions","Wide Receiver"]
[{"$f":"RANK(S170,$S:$S,0)+COUNTIF($S$3:S170,S170)-1","v":16},"Detroit Lions","Wide Receiver"]
[{"$f":"RANK(S171,$S:$S,0)+COUNTIF($S$3:S171,S171)-1","v":16},"Detroit Lions","Wide Receiver"]
[{"$f":"RANK(S172,$S:$S,0)+COUNTIF($S$3:S172,S172)-1","v":16},"Detroit Lions","Wide Receiver"]
[{"$f":"RANK(S173,$S:$S,0)+COUNTIF($S$3:S173,S173)-1","v":16},"Detroit Lions","Wide Receiver"]
[{"$f":"RANK(S174,$S:$S,0)+COUNTIF($S$3:S174,S174)-1","v":16},"Detroit Lions","Wide Receiver"]
[{"$f":"RANK(S175,$S:$S,0)+COUNTIF($S$3:S175,S175)-1","v":16},"Detroit Lions","Tight End"]
[{"$f":"RANK(S176,$S:$S,0)+COUNTIF($S$3:S176,S176)-1","v":16},"Detroit Lions","Tight End"]
[{"$f":"RANK(S177,$S:$S,0)+COUNTIF($S$3:S177,S177)-1","v":16},"Detroit Lions","Tight End"]
[{"$f":"RANK(S178,$S:$S,0)+COUNTIF($S$3:S178,S178)-1","v":16},"Detroit Lions","Tight End"]
[{"$f":"RANK(S179,$S:$S,0)+COUNTIF($S$3:S179,S179)-1","v":16},"Green Bay Packers","Running Back"]
[{"$f":"RANK(S180,$S:$S,0)+COUNTIF($S$3:S180,S180)-1","v":16},"Green Bay Packers","Running Back"]
[{"$f":"RANK(S181,$S:$S,0)+COUNTIF($S$3:S181,S181)-1","v":16},"Green Bay Packers","Running Back"]
[{"$f":"RANK(S182,$S:$S,0)+COUNTIF($S$3:S182,S182)-1","v":16},"Green Bay Packers","Running Back"]
[{"$f":"RANK(S183,$S:$S,0)+COUNTIF($S$3:S183,S183)-1","v":16},"Green Bay Packers","Wide Receiver"]
[{"$f":"RANK(S184,$S:$S,0)+COUNTIF($S$3:S184,S184)-1","v":16},"Green Bay Packers","Wide Receiver"]
[{"$f":"RANK(S185,$S:$S,0)+COUNTIF($S$3:S185,S185)-1","v":16},"Green Bay Packers","Wide Receiver"]
[{"$f":"RANK(S186,$S:$S,0)+COUNTIF($S$3:S186,S186)-1","v":16},"Green Bay Packers","Wide Receiver"]
[{"$f":"RANK(S187,$S:$S,0)+COUNTIF($S$3:S187,S187)-1","v":16},"Green Bay Packers","Wide Receiver"]
[{"$f":"RANK(S188,$S:$S,0)+COUNTIF($S$3:S188,S188)-1","v":16},"Green Bay Packers","Wide Receiver"]
[{"$f":"RANK(S189,$S:$S,0)+COUNTIF($S$3:S189,S189)-1","v":16},"Green Bay Packers","Wide Receiver"]
[{"$f":"RANK(S190,$S:$S,0)+COUNTIF($S$3:S190,S190)-1","v":16},"Green Bay Packers","Wide Receiver"]
[{"$f":"RANK(S191,$S:$S,0)+COUNTIF($S$3:S191,S191)-1","v":16},"Green Bay Packers","Tight End"]
[{"$f":"RANK(S192,$S:$S,0)+COUNTIF($S$3:S192,S192)-1","v":16},"Green Bay Packers","Tight End"]
[{"$f":"RANK(S193,$S:$S,0)+COUNTIF($S$3:S193,S193)-1","v":16},"Green Bay Packers","Tight End"]
[{"$f":"RANK(S194,$S:$S,0)+COUNTIF($S$3:S194,S194)-1","v":16},"Green Bay Packers","Tight End"]
[{"$f":"RANK(S195,$S:$S,0)+COUNTIF($S$3:S195,S195)-1","v":16},"Houston Texans","Running Back"]
[{"$f":"RANK(S196,$S:$S,0)+COUNTIF($S$3:S196,S196)-1","v":16},"Houston Texans","Running Back"]
[{"$f":"RANK(S197,$S:$S,0)+COUNTIF($S$3:S197,S197)-1","v":16},"Houston Texans","Running Back"]
[{"$f":"RANK(S198,$S:$S,0)+COUNTIF($S$3:S198,S198)-1","v":16},"Houston Texans","Running Back"]
[{"$f":"RANK(S199,$S:$S,0)+COUNTIF($S$3:S199,S199)-1","v":16},"Houston Texans","Wide Receiver"]
[{"$f":"RANK(S200,$S:$S,0)+COUNTIF($S$3:S200,S200)-1","v":16},"Houston Texans","Wide Receiver"]
[{"$f":"RANK(S201,$S:$S,0)+COUNTIF($S$3:S201,S201)-1","v":16},"Houston Texans","Wide Receiver"]
[{"$f":"RANK(S202,$S:$S,0)+COUNTIF($S$3:S202,S202)-1","v":16},"Houston Texans","Wide Receiver"]
[{"$f":"RANK(S203,$S:$S,0)+COUNTIF($S$3:S203,S203)-1","v":16},"Houston Texans","Wide Receiver"]
[{"$f":"RANK(S204,$S:$S,0)+COUNTIF($S$3:S204,S204)-1","v":16},"Houston Texans","Wide Receiver"]
[{"$f":"RANK(S205,$S:$S,0)+COUNTIF($S$3:S205,S205)-1","v":16},"Houston Texans","Wide Receiver"]
[{"$f":"RANK(S206,$S:$S,0)+COUNTIF($S$3:S206,S206)-1","v":16},"Houston Texans","Wide Receiver"]
[{"$f":"RANK(S207,$S:$S,0)+COUNTIF($S$3:S207,S207)-1","v":16},"Houston Texans","Tight End"]
[{"$f":"RANK(S208,$S:$S,0)+COUNTIF($S$3:S208,S208)-1","v":16},"Houston Texans","Tight End"]
[{"$f":"RANK(S209,$S:$S,0)+COUNTIF($S$3:S209,S209)-1","v":16},"Houston Texans","Tight End"]
[{"$f":"RANK(S210,$S:$S,0)+COUNTIF($S$3:S210,S210)-1","v":16},"Houston Texans","Tight End"]
[{"$f":"RANK(S211,$S:$S,0)+COUNTIF($S$3:S211,S211)-1","v":16},"Indianapolis Colts","Running Back"]
[{"$f":"RANK(S212,$S:$S,0)+COUNTIF($S$3:S212,S212)-1","v":16},"Indianapolis Colts","Running Back"]
[{"$f":"RANK(S213,$S:$S,0)+COUNTIF($S$3:S213,S213)-1","v":16},"Indianapolis Colts","Running Back"]
[{"$f":"RANK(S214,$S:$S,0)+COUNTIF($S$3:S214,S214)-1","v":16},"Indianapolis Colts","Running Back"]
[{"$f":"RANK(S215,$S:$S,0)+COUNTIF($S$3:S215,S215)-1","v":16},"Indianapolis Colts","Wide Receiver"]
[{"$f":"RANK(S216,$S:$S,0)+COUNTIF($S$3:S216,S216)-1","v":16},"Indianapolis Colts","Wide Receiver"]
[{"$f":"RANK(S217,$S:$S,0)+COUNTIF($S$3:S217,S217)-1","v":16},"Indianapolis Colts","Wide Receiver"]
[{"$f":"RANK(S218,$S:$S,0)+COUNTIF($S$3:S218,S218)-1","v":16},"Indianapolis Colts","Wide Receiver"]
[{"$f":"RANK(S219,$S:$S,0)+COUNTIF($S$3:S219,S219)-1","v":16},"Indianapolis Colts","Wide Receiver"]
[{"$f":"RANK(S220,$S:$S,0)+COUNTIF($S$3:S220,S220)-1","v":16},"Indianapolis Colts","Wide Receiver"]
[{"$f":"RANK(S221,$S:$S,0)+COUNTIF($S$3:S221,S221)-1","v":16},"Indianapolis Colts","Wide Receiver"]
[{"$f":"RANK(S222,$S:$S,0)+COUNTIF($S$3:S222,S222)-1","v":16},"Indianapolis Colts","Wide Receiver"]
[{"$f":"RANK(S223,$S:$S,0)+COUNTIF($S$3:S223,S223)-1","v":16},"Indianapolis Colts","Tight End"]
[{"$f":"RANK(S224,$S:$S,0)+COUNTIF($S$3:S224,S224)-1","v":16},"Indianapolis Colts","Tight End"]
[{"$f":"RANK(S225,$S:$S,0)+COUNTIF($S$3:S225,S225)-1","v":16},"Indianapolis Colts","Tight End"]
[{"$f":"RANK(S226,$S:$S,0)+COUNTIF($S$3:S226,S226)-1","v":16},"Indianapolis Colts","Tight End"]
[{"$f":"RANK(S227,$S:$S,0)+COUNTIF($S$3:S227,S227)-1","v":16},"Jacksonville Jaguars","Running Back"]
[{"$f":"RANK(S228,$S:$S,0)+COUNTIF($S$3:S228,S228)-1","v":16},"Jacksonville Jaguars","Running Back"]
[{"$f":"RANK(S229,$S:$S,0)+COUNTIF($S$3:S229,S229)-1","v":16},"Jacksonville Jaguars","Running Back"]
[{"$f":"RANK(S230,$S:$S,0)+COUNTIF($S$3:S230,S230)-1","v":16},"Jacksonville Jaguars","Running Back"]
[{"$f":"RANK(S231,$S:$S,0)+COUNTIF($S$3:S231,S231)-1","v":16},"Jacksonville Jaguars","Wide Receiver"]
[{"$f":"RANK(S232,$S:$S,0)+COUNTIF($S$3:S232,S232)-1","v":16},"Jacksonville Jaguars","Wide Receiver"]
[{"$f":"RANK(S233,$S:$S,0)+COUNTIF($S$3:S233,S233)-1","v":16},"Jacksonville Jaguars","Wide Receiver"]
[{"$f":"RANK(S234,$S:$S,0)+COUNTIF($S$3:S234,S234)-1","v":16},"Jacksonville Jaguars","Wide Receiver"]
[{"$f":"RANK(S235,$S:$S,0)+COUNTIF($S$3:S235,S235)-1","v":16},"Jacksonville Jaguars","Wide Receiver"]
[{"$f":"RANK(S236,$S:$S,0)+COUNTIF($S$3:S236,S236)-1","v":16},"Jacksonville Jaguars","Wide Receiver"]
[{"$f":"RANK(S237,$S:$S,0)+COUNTIF($S$3:S237,S237)-1","v":16},"Jacksonville Jaguars","Wide Receiver"]
[{"$f":"RANK(S238,$S:$S,0)+COUNTIF($S$3:S238,S238)-1","v":16},"Jacksonville Jaguars","Wide Receiver"]
[{"$f":"RANK(S239,$S:$S,0)+COUNTIF($S$3:S239,S239)-1","v":16},"Jacksonville Jaguars","Tight End"]
[{"$f":"RANK(S240,$S:$S,0)+COUNTIF($S$3:S240,S240)-1","v":16},"Jacksonville Jaguars","Tight End"]
[{"$f":"RANK(S241,$S:$S,0)+COUNTIF($S$3:S241,S241)-1","v":16},"Jacksonville Jaguars","Tight End"]
[{"$f":"RANK(S242,$S:$S,0)+COUNTIF($S$3:S242,S242)-1","v":16},"Jacksonville Jaguars","Tight End"]
[{"$f":"RANK(S243,$S:$S,0)+COUNTIF($S$3:S243,S243)-1","v":16},"Kansas City Chiefs","Running Back"]
[{"$f":"RANK(S244,$S:$S,0)+COUNTIF($S$3:S244,S244)-1","v":16},"Kansas City Chiefs","Running Back"]
[{"$f":"RANK(S245,$S:$S,0)+COUNTIF($S$3:S245,S245)-1","v":16},"Kansas City Chiefs","Running Back"]
[{"$f":"RANK(S246,$S:$S,0)+COUNTIF($S$3:S246,S246)-1","v":16},"Kansas City Chiefs","Running Back"]
[{"$f":"RANK(S247,$S:$S,0)+COUNTIF($S$3:S247,S247)-1","v":16},"Kansas City Chiefs","Wide Receiver"]
[{"$f":"RANK(S248,$S:$S,0)+COUNTIF($S$3:S248,S248)-1","v":16},"Kansas City Chiefs","Wide Receiver"]
[{"$f":"RANK(S249,$S:$S,0)+COUNTIF($S$3:S249,S249)-1","v":16},"Kansas City Chiefs","Wide Receiver"]
[{"$f":"RANK(S250,$S:$S,0)+COUNTIF($S$3:S250,S250)-1","v":16},"Kansas City Chiefs","Wide Receiver"]
[{"$f":"RANK(S251,$S:$S,0)+COUNTIF($S$3:S251,S251)-1","v":16},"Kansas City Chiefs","Wide Receiver"]
[{"$f":"RANK(S252,$S:$S,0)+COUNTIF($S$3:S252,S252)-1","v":16},"Kansas City Chiefs","Wide Receiver"]
[{"$f":"RANK(S253,$S:$S,0)+COUNTIF($S$3:S253,S253)-1","v":16},"Kansas City Chiefs","Wide Receiver"]
[{"$f":"RANK(S254,$S:$S,0)+COUNTIF($S$3:S254,S254)-1","v":16},"Kansas City Chiefs","Wide Receiver"]
[{"$f":"RANK(S255,$S:$S,0)+COUNTIF($S$3:S255,S255)-1","v":16},"Kansas City Chiefs","Tight End"]
[{"$f":"RANK(S256,$S:$S,0)+COUNTIF($S$3:S256,S256)-1","v":16},"Kansas City Chiefs","Tight End"]
[{"$f":"RANK(S257,$S:$S,0)+COUNTIF($S$3:S257,S257)-1","v":16},"Kansas City Chiefs","Tight End"]
[{"$f":"RANK(S258,$S:$S,0)+COUNTIF($S$3:S258,S258)-1","v":16},"Kansas City Chiefs","Tight End"]
[{"$f":"RANK(S259,$S:$S,0)+COUNTIF($S$3:S259,S259)-1","v":16},"Las Vegas Raiders","Running Back"]
[{"$f":"RANK(S260,$S:$S,0)+COUNTIF($S$3:S260,S260)-1","v":16},"Las Vegas Raiders","Running Back"]
[{"$f":"RANK(S261,$S:$S,0)+COUNTIF($S$3:S261,S261)-1","v":16},"Las Vegas Raiders","Running Back"]
[{"$f":"RANK(S262,$S:$S,0)+COUNTIF($S$3:S262,S262)-1","v":16},"Las Vegas Raiders","Running Back"]
[{"$f":"RANK(S263,$S:$S,0)+COUNTIF($S$3:S263,S263)-1","v":16},"Las Vegas Raiders","Wide Receiver"]
[{"$f":"RANK(S264,$S:$S,0)+COUNTIF($S$3:S264,S264)-1","v":16},"Las Vegas Raiders","Wide Receiver"]
[{"$f":"RANK(S265,$S:$S,0)+COUNTIF($S$3:S265,S265)-1","v":16},"Las Vegas Raiders","Wide Receiver"]
[{"$f":"RANK(S266,$S:$S,0)+COUNTIF($S$3:S266,S266)-1","v":16},"Las Vegas Raiders","Wide Receiver"]
[{"$f":"RANK(S267,$S:$S,0)+COUNTIF($S$3:S267,S267)-1","v":16},"Las Vegas Raiders","Wide Receiver"]
[{"$f":"RANK(S268,$S:$S,0)+COUNTIF($S$3:S268,S268)-1","v":16},"Las Vegas Raiders","Wide Receiver"]
[{"$f":"RANK(S269,$S:$S,0)+COUNTIF($S$3:S269,S269)-1","v":16},"Las Vegas Raiders","Wide Receiver"]
[{"$f":"RANK(S270,$S:$S,0)+COUNTIF($S$3:S270,S270)-1","v":16},"Las Vegas Raiders","Wide Receiver"]
[{"$f":"RANK(S271,$S:$S,0)+COUNTIF($S$3:S271,S271)-1","v":16},"Las Vegas Raiders","Tight End"]
[{"$f":"RANK(S272,$S:$S,0)+COUNTIF($S$3:S272,S272)-1","v":16},"Las Vegas Raiders","Tight End"]
[{"$f":"RANK(S273,$S:$S,0)+COUNTIF($S$3:S273,S273)-1","v":16},"Las Vegas Raiders","Tight End"]
[{"$f":"RANK(S274,$S:$S,0)+COUNTIF($S$3:S274,S274)-1","v":16},"Las Vegas Raiders","Tight End"]
[{"$f":"RANK(S275,$S:$S,0)+COUNTIF($S$3:S275,S275)-1","v":16},"Los Angeles Chargers","Running Back"]
[{"$f":"RANK(S276,$S:$S,0)+COUNTIF($S$3:S276,S276)-1","v":16},"Los Angeles Chargers","Running Back"]
[{"$f":"RANK(S277,$S:$S,0)+COUNTIF($S$3:S277,S277)-1","v":16},"Los Angeles Chargers","Running Back"]
[{"$f":"RANK(S278,$S:$S,0)+COUNTIF($S$3:S278,S278)-1","v":16},"Los Angeles Chargers","Running Back"]
[{"$f":"RANK(S279,$S:$S,0)+COUNTIF($S$3:S279,S279)-1","v":16},"Los Angeles Chargers","Wide Receiver"]
[{"$f":"RANK(S280,$S:$S,0)+COUNTIF($S$3:S280,S280)-1","v":16},"Los Angeles Chargers","Wide Receiver"]
[{"$f":"RANK(S281,$S:$S,0)+COUNTIF($S$3:S281,S281)-1","v":16},"Los Angeles Chargers","Wide Receiver"]
[{"$f":"RANK(S282,$S:$S,0)+COUNTIF($S$3:S282,S282)-1","v":16},"Los Angeles Chargers","Wide Receiver"]
[{"$f":"RANK(S283,$S:$S,0)+COUNTIF($S$3:S283,S283)-1","v":16},"Los Angeles Chargers","Wide Receiver"]
[{"$f":"RANK(S284,$S:$S,0)+COUNTIF($S$3:S284,S284)-1","v":16},"Los Angeles Chargers","Wide Receiver"]
[{"$f":"RANK(S285,$S:$S,0)+COUNTIF($S$3:S285,S285)-1","v":16},"Los Angeles Chargers","Wide Receiver"]
[{"$f":"RANK(S286,$S:$S,0)+COUNTIF($S$3:S286,S286)-1","v":16},"Los Angeles Chargers","Wide Receiver"]
[{"$f":"RANK(S287,$S:$S,0)+COUNTIF($S$3:S287,S287)-1","v":16},"Los Angeles Chargers","Tight End"]
[{"$f":"RANK(S288,$S:$S,0)+COUNTIF($S$3:S288,S288)-1","v":16},"Los Angeles Chargers","Tight End"]
[{"$f":"RANK(S289,$S:$S,0)+COUNTIF($S$3:S289,S289)-1","v":16},"Los Angeles Chargers","Tight End"]
[{"$f":"RANK(S290,$S:$S,0)+COUNTIF($S$3:S290,S290)-1","v":16},"Los Angeles Chargers","Tight End"]
[{"$f":"RANK(S291,$S:$S,0)+COUNTIF($S$3:S291,S291)-1","v":16},"Los Angeles Rams","Running Back"]
[{"$f":"RANK(S292,$S:$S,0)+COUNTIF($S$3:S292,S292)-1","v":16},"Los Angeles Rams","Running Back"]
[{"$f":"RANK(S293,$S:$S,0)+COUNTIF($S$3:S293,S293)-1","v":16},"Los Angeles Rams","Running Back"]
[{"$f":"RANK(S294,$S:$S,0)+COUNTIF($S$3:S294,S294)-1","v":16},"Los Angeles Rams","Running Back"]
[{"$f":"RANK(S295,$S:$S,0)+COUNTIF($S$3:S295,S295)-1","v":16},"Los Angeles Rams","Wide Receiver"]
[{"$f":"RANK(S296,$S:$S,0)+COUNTIF($S$3:S296,S296)-1","v":16},"Los Angeles Rams","Wide Receiver"]
[{"$f":"RANK(S297,$S:$S,0)+COUNTIF($S$3:S297,S297)-1","v":16},"Los Angeles Rams","Wide Receiver"]
[{"$f":"RANK(S298,$S:$S,0)+COUNTIF($S$3:S298,S298)-1","v":16},"Los Angeles Rams","Wide Receiver"]
[{"$f":"RANK(S299,$S:$S,0)+COUNTIF($S$3:S299,S299)-1","v":16},"Los Angeles Rams","Wide Receiver"]
[{"$f":"RANK(S300,$S:$S,0)+COUNTIF($S$3:S300,S300)-1","v":16},"Los Angeles Rams","Wide Receiver"]
[{"$f":"RANK(S301,$S:$S,0)+COUNTIF($S$3:S301,S301)-1","v":16},"Los Angeles Rams","Wide Receiver"]
[{"$f":"RANK(S302,$S:$S,0)+COUNTIF($S$3:S302,S302)-1","v":16},"Los Angeles Rams","Wide Receiver"]
[{"$f":"RANK(S303,$S:$S,0)+COUNTIF($S$3:S303,S303)-1","v":16},"Los Angeles Rams","Tight End"]
[{"$f":"RANK(S304,$S:$S,0)+COUNTIF($S$3:S304,S304)-1","v":16},"Los Angeles Rams","Tight End"]
[{"$f":"RANK(S305,$S:$S,0)+COUNTIF($S$3:S305,S305)-1","v":16},"Los Angeles Rams","Tight End"]
[{"$f":"RANK(S306,$S:$S,0)+COUNTIF($S$3:S306,S306)-1","v":16},"Los Angeles Rams","Tight End"]
[{"$f":"RANK(S307,$S:$S,0)+COUNTIF($S$3:S307,S307)-1","v":16},"Miami Dolphins","Running Back"]
[{"$f":"RANK(S308,$S:$S,0)+COUNTIF($S$3:S308,S308)-1","v":16},"Miami Dolphins","Running Back"]
[{"$f":"RANK(S309,$S:$S,0)+COUNTIF($S$3:S309,S309)-1","v":16},"Miami Dolphins","Running Back"]
[{"$f":"RANK(S310,$S:$S,0)+COUNTIF($S$3:S310,S310)-1","v":16},"Miami Dolphins","Running Back"]
[{"$f":"RANK(S311,$S:$S,0)+COUNTIF($S$3:S311,S311)-1","v":16},"Miami Dolphins","Wide Receiver"]
[{"$f":"RANK(S312,$S:$S,0)+COUNTIF($S$3:S312,S312)-1","v":16},"Miami Dolphins","Wide Receiver"]
[{"$f":"RANK(S313,$S:$S,0)+COUNTIF($S$3:S313,S313)-1","v":16},"Miami Dolphins","Wide Receiver"]
[{"$f":"RANK(S314,$S:$S,0)+COUNTIF($S$3:S314,S314)-1","v":16},"Miami Dolphins","Wide Receiver"]
[{"$f":"RANK(S315,$S:$S,0)+COUNTIF($S$3:S315,S315)-1","v":16},"Miami Dolphins","Wide Receiver"]
[{"$f":"RANK(S316,$S:$S,0)+COUNTIF($S$3:S316,S316)-1","v":16},"Miami Dolphins","Wide Receiver"]
[{"$f":"RANK(S317,$S:$S,0)+COUNTIF($S$3:S317,S317)-1","v":16},"Miami Dolphins","Wide Receiver"]
[{"$f":"RANK(S318,$S:$S,0)+COUNTIF($S$3:S318,S318)-1","v":16},"Miami Dolphins","Wide Receiver"]
[{"$f":"RANK(S319,$S:$S,0)+COUNTIF($S$3:S319,S319)-1","v":16},"Miami Dolphins","Tight End"]
[{"$f":"RANK(S320,$S:$S,0)+COUNTIF($S$3:S320,S320)-1","v":16},"Miami Dolphins","Tight End"]
[{"$f":"RANK(S321,$S:$S,0)+COUNTIF($S$3:S321,S321)-1","v":16},"Miami Dolphins","Tight End"]
[{"$f":"RANK(S322,$S:$S,0)+COUNTIF($S$3:S322,S322)-1","v":16},"Miami Dolphins","Tight End"]
[{"$f":"RANK(S323,$S:$S,0)+COUNTIF($S$3:S323,S323)-1","v":16},"Minnesota Vikings","Running Back"]
[{"$f":"RANK(S324,$S:$S,0)+COUNTIF($S$3:S324,S324)-1","v":16},"Minnesota Vikings","Running Back"]
[{"$f":"RANK(S325,$S:$S,0)+COUNTIF($S$3:S325,S325)-1","v":16},"Minnesota Vikings","Running Back"]
[{"$f":"RANK(S326,$S:$S,0)+COUNTIF($S$3:S326,S326)-1","v":16},"Minnesota Vikings","Running Back"]
[{"$f":"RANK(S327,$S:$S,0)+COUNTIF($S$3:S327,S327)-1","v":16},"Minnesota Vikings","Wide Receiver"]
[{"$f":"RANK(S328,$S:$S,0)+COUNTIF($S$3:S328,S328)-1","v":16},"Minnesota Vikings","Wide Receiver"]
[{"$f":"RANK(S329,$S:$S,0)+COUNTIF($S$3:S329,S329)-1","v":16},"Minnesota Vikings","Wide Receiver"]
[{"$f":"RANK(S330,$S:$S,0)+COUNTIF($S$3:S330,S330)-1","v":16},"Minnesota Vikings","Wide Receiver"]
[{"$f":"RANK(S331,$S:$S,0)+COUNTIF($S$3:S331,S331)-1","v":16},"Minnesota Vikings","Wide Receiver"]
[{"$f":"RANK(S332,$S:$S,0)+COUNTIF($S$3:S332,S332)-1","v":16},"Minnesota Vikings","Wide Receiver"]
[{"$f":"RANK(S333,$S:$S,0)+COUNTIF($S$3:S333,S333)-1","v":16},"Minnesota Vikings","Wide Receiver"]
[{"$f":"RANK(S334,$S:$S,0)+COUNTIF($S$3:S334,S334)-1","v":16},"Minnesota Vikings","Wide Receiver"]
[{"$f":"RANK(S335,$S:$S,0)+COUNTIF($S$3:S335,S335)-1","v":16},"Minnesota Vikings","Tight End"]
[{"$f":"RANK(S336,$S:$S,0)+COUNTIF($S$3:S336,S336)-1","v":16},"Minnesota Vikings","Tight End"]
[{"$f":"RANK(S337,$S:$S,0)+COUNTIF($S$3:S337,S337)-1","v":16},"Minnesota Vikings","Tight End"]
[{"$f":"RANK(S338,$S:$S,0)+COUNTIF($S$3:S338,S338)-1","v":16},"Minnesota Vikings","Tight End"]
[{"$f":"RANK(S339,$S:$S,0)+COUNTIF($S$3:S339,S339)-1","v":16},"New England Patriots","Running Back"]
[{"$f":"RANK(S340,$S:$S,0)+COUNTIF($S$3:S340,S340)-1","v":16},"New England Patriots","Running Back"]
[{"$f":"RANK(S341,$S:$S,0)+COUNTIF($S$3:S341,S341)-1","v":16},"New England Patriots","Running Back"]
[{"$f":"RANK(S342,$S:$S,0)+COUNTIF($S$3:S342,S342)-1","v":16},"New England Patriots","Running Back"]
[{"$f":"RANK(S343,$S:$S,0)+COUNTIF($S$3:S343,S343)-1","v":16},"New England Patriots","Wide Receiver"]
[{"$f":"RANK(S344,$S:$S,0)+COUNTIF($S$3:S344,S344)-1","v":16},"New England Patriots","Wide Receiver"]
[{"$f":"RANK(S345,$S:$S,0)+COUNTIF($S$3:S345,S345)-1","v":16},"New England Patriots","Wide Receiver"]
[{"$f":"RANK(S346,$S:$S,0)+COUNTIF($S$3:S346,S346)-1","v":16},"New England Patriots","Wide Receiver"]
[{"$f":"RANK(S347,$S:$S,0)+COUNTIF($S$3:S347,S347)-1","v":16},"New England Patriots","Wide Receiver"]
[{"$f":"RANK(S348,$S:$S,0)+COUNTIF($S$3:S348,S348)-1","v":16},"New England Patriots","Wide Receiver"]
[{"$f":"RANK(S349,$S:$S,0)+COUNTIF($S$3:S349,S349)-1","v":16},"New England Patriots","Wide Receiver"]
[{"$f":"RANK(S350,$S:$S,0)+COUNTIF($S$3:S350,S350)-1","v":16},"New England Patriots","Wide Receiver"]
[{"$f":"RANK(S351,$S:$S,0)+COUNTIF($S$3:S351,S351)-1","v":16},"New England Patriots","Tight End"]
[{"$f":"RANK(S352,$S:$S,0)+COUNTIF($S$3:S352,S352)-1","v":16},"New England Patriots","Tight End"]
[{"$f":"RANK(S353,$S:$S,0)+COUNTIF($S$3:S353,S353)-1","v":16},"New England Patriots","Tight End"]
[{"$f":"RANK(S354,$S:$S,0)+COUNTIF($S$3:S354,S354)-1","v":16},"New England Patriots","Tight End"]
[{"$f":"RANK(S355,$S:$S,0)+COUNTIF($S$3:S355,S355)-1","v":16},"New Orleans Saints","Running Back"]
[{"$f":"RANK(S356,$S:$S,0)+COUNTIF($S$3:S356,S356)-1","v":16},"New Orleans Saints","Running Back"]
[{"$f":"RANK(S357,$S:$S,0)+COUNTIF($S$3:S357,S357)-1","v":16},"New Orleans Saints","Running Back"]
[{"$f":"RANK(S358,$S:$S,0)+COUNTIF($S$3:S358,S358)-1","v":16},"New Orleans Saints","Running Back"]
[{"$f":"RANK(S359,$S:$S,0)+COUNTIF($S$3:S359,S359)-1","v":16},"New Orleans Saints","Wide Receiver"]
[{"$f":"RANK(S360,$S:$S,0)+COUNTIF($S$3:S360,S360)-1","v":16},"New Orleans Saints","Wide Receiver"]
[{"$f":"RANK(S361,$S:$S,0)+COUNTIF($S$3:S361,S361)-1","v":16},"New Orleans Saints","Wide Receiver"]
[{"$f":"RANK(S362,$S:$S,0)+COUNTIF($S$3:S362,S362)-1","v":16},"New Orleans Saints","Wide Receiver"]
[{"$f":"RANK(S363,$S:$S,0)+COUNTIF($S$3:S363,S363)-1","v":16},"New Orleans Saints","Wide Receiver"]
[{"$f":"RANK(S364,$S:$S,0)+COUNTIF($S$3:S364,S364)-1","v":16},"New Orleans Saints","Wide Receiver"]
[{"$f":"RANK(S365,$S:$S,0)+COUNTIF($S$3:S365,S365)-1","v":16},"New Orleans Saints","Wide Receiver"]
[{"$f":"RANK(S366,$S:$S,0)+COUNTIF($S$3:S366,S366)-1","v":16},"New Orleans Saints","Wide Receiver"]
[{"$f":"RANK(S367,$S:$S,0)+COUNTIF($S$3:S367,S367)-1","v":16},"New Orleans Saints","Tight End"]
[{"$f":"RANK(S368,$S:$S,0)+COUNTIF($S$3:S368,S368)-1","v":16},"New Orleans Saints","Tight End"]
[{"$f":"RANK(S369,$S:$S,0)+COUNTIF($S$3:S369,S369)-1","v":16},"New Orleans Saints","Tight End"]
[{"$f":"RANK(S370,$S:$S,0)+COUNTIF($S$3:S370,S370)-1","v":16},"New Orleans Saints","Tight End"]
[{"$f":"RANK(S371,$S:$S,0)+COUNTIF($S$3:S371,S371)-1","v":16},"New York Giants","Running Back"]
[{"$f":"RANK(S372,$S:$S,0)+COUNTIF($S$3:S372,S372)-1","v":16},"New York Giants","Running Back"]
[{"$f":"RANK(S373,$S:$S,0)+COUNTIF($S$3:S373,S373)-1","v":16},"New York Giants","Running Back"]
[{"$f":"RANK(S374,$S:$S,0)+COUNTIF($S$3:S374,S374)-1","v":16},"New York Giants","Running Back"]
[{"$f":"RANK(S375,$S:$S,0)+COUNTIF($S$3:S375,S375)-1","v":16},"New York Giants","Wide Receiver"]
[{"$f":"RANK(S376,$S:$S,0)+COUNTIF($S$3:S376,S376)-1","v":16},"New York Giants","Wide Receiver"]
[{"$f":"RANK(S377,$S:$S,0)+COUNTIF($S$3:S377,S377)-1","v":16},"New York Giants","Wide Receiver"]
[{"$f":"RANK(S378,$S:$S,0)+COUNTIF($S$3:S378,S378)-1","v":16},"New York Giants","Wide Receiver"]
[{"$f":"RANK(S379,$S:$S,0)+COUNTIF($S$3:S379,S379)-1","v":16},"New York Giants","Wide Receiver"]
[{"$f":"RANK(S380,$S:$S,0)+COUNTIF($S$3:S380,S380)-1","v":16},"New York Giants","Wide Receiver"]
[{"$f":"RANK(S381,$S:$S,0)+COUNTIF($S$3:S381,S381)-1","v":16},"New York Giants","Wide Receiver"]
[{"$f":"RANK(S382,$S:$S,0)+COUNTIF($S$3:S382,S382)-1","v":16},"New York Giants","Wide Receiver"]
[{"$f":"RANK(S383,$S:$S,0)+COUNTIF($S$3:S383,S383)-1","v":16},"New York Giants","Tight End"]
[{"$f":"RANK(S384,$S:$S,0)+COUNTIF($S$3:S384,S384)-1","v":16},"New York Giants","Tight End"]
[{"$f":"RANK(S385,$S:$S,0)+COUNTIF($S$3:S385,S385)-1","v":16},"New York Giants","Tight End"]
[{"$f":"RANK(S386,$S:$S,0)+COUNTIF($S$3:S386,S386)-1","v":16},"New York Giants","Tight End"]
[{"$f":"RANK(S387,$S:$S,0)+COUNTIF($S$3:S387,S387)-1","v":16},"New York Jets","Running Back"]
[{"$f":"RANK(S388,$S:$S,0)+COUNTIF($S$3:S388,S388)-1","v":16},"New York Jets","Running Back"]
[{"$f":"RANK(S389,$S:$S,0)+COUNTIF($S$3:S389,S389)-1","v":16},"New York Jets","Running Back"]
[{"$f":"RANK(S390,$S:$S,0)+COUNTIF($S$3:S390,S390)-1","v":16},"New York Jets","Running Back"]
[{"$f":"RANK(S391,$S:$S,0)+COUNTIF($S$3:S391,S391)-1","v":16},"New York Jets","Wide Receiver"]
[{"$f":"RANK(S392,$S:$S,0)+COUNTIF($S$3:S392,S392)-1","v":16},"New York Jets","Wide Receiver"]
[{"$f":"RANK(S393,$S:$S,0)+COUNTIF($S$3:S393,S393)-1","v":16},"New York Jets","Wide Receiver"]
[{"$f":"RANK(S394,$S:$S,0)+COUNTIF($S$3:S394,S394)-1","v":16},"New York Jets","Wide Receiver"]
[{"$f":"RANK(S395,$S:$S,0)+COUNTIF($S$3:S395,S395)-1","v":16},"New York Jets","Wide Receiver"]
[{"$f":"RANK(S396,$S:$S,0)+COUNTIF($S$3:S396,S396)-1","v":16},"New York Jets","Wide Receiver"]
[{"$f":"RANK(S397,$S:$S,0)+COUNTIF($S$3:S397,S397)-1","v":16},"New York Jets","Wide Receiver"]
[{"$f":"RANK(S398,$S:$S,0)+COUNTIF($S$3:S398,S398)-1","v":16},"New York Jets","Wide Receiver"]
[{"$f":"RANK(S399,$S:$S,0)+COUNTIF($S$3:S399,S399)-1","v":16},"New York Jets","Tight End"]
[{"$f":"RANK(S400,$S:$S,0)+COUNTIF($S$3:S400,S400)-1","v":16},"New York Jets","Tight End"]
[{"$f":"RANK(S401,$S:$S,0)+COUNTIF($S$3:S401,S401)-1","v":16},"New York Jets","Tight End"]
[{"$f":"RANK(S402,$S:$S,0)+COUNTIF($S$3:S402,S402)-1","v":16},"New York Jets","Tight End"]
[{"$f":"RANK(S403,$S:$S,0)+COUNTIF($S$3:S403,S403)-1","v":16},"Philadelphia Eagles","Running Back"]
[{"$f":"RANK(S404,$S:$S,0)+COUNTIF($S$3:S404,S404)-1","v":16},"Philadelphia Eagles","Running Back"]
[{"$f":"RANK(S405,$S:$S,0)+COUNTIF($S$3:S405,S405)-1","v":16},"Philadelphia Eagles","Running Back"]
[{"$f":"RANK(S406,$S:$S,0)+COUNTIF($S$3:S406,S406)-1","v":16},"Philadelphia Eagles","Running Back"]
[{"$f":"RANK(S407,$S:$S,0)+COUNTIF($S$3:S407,S407)-1","v":16},"Philadelphia Eagles","Wide Receiver"]
[{"$f":"RANK(S408,$S:$S,0)+COUNTIF($S$3:S408,S408)-1","v":16},"Philadelphia Eagles","Wide Receiver"]
[{"$f":"RANK(S409,$S:$S,0)+COUNTIF($S$3:S409,S409)-1","v":16},"Philadelphia Eagles","Wide Receiver"]
[{"$f":"RANK(S410,$S:$S,0)+COUNTIF($S$3:S410,S410)-1","v":16},"Philadelphia Eagles","Wide Receiver"]
[{"$f":"RANK(S411,$S:$S,0)+COUNTIF($S$3:S411,S411)-1","v":16},"Philadelphia Eagles","Wide Receiver"]
[{"$f":"RANK(S412,$S:$S,0)+COUNTIF($S$3:S412,S412)-1","v":16},"Philadelphia Eagles","Wide Receiver"]
[{"$f":"RANK(S413,$S:$S,0)+COUNTIF($S$3:S413,S413)-1","v":16},"Philadelphia Eagles","Wide Receiver"]
[{"$f":"RANK(S414,$S:$S,0)+COUNTIF($S$3:S414,S414)-1","v":16},"Philadelphia Eagles","Wide Receiver"]
[{"$f":"RANK(S415,$S:$S,0)+COUNTIF($S$3:S415,S415)-1","v":16},"Philadelphia Eagles","Tight End"]
[{"$f":"RANK(S416,$S:$S,0)+COUNTIF($S$3:S416,S416)-1","v":16},"Philadelphia Eagles","Tight End"]
[{"$f":"RANK(S417,$S:$S,0)+COUNTIF($S$3:S417,S417)-1","v":16},"Philadelphia Eagles","Tight End"]
[{"$f":"RANK(S418,$S:$S,0)+COUNTIF($S$3:S418,S418)-1","v":16},"Philadelphia Eagles","Tight End"]
[{"$f":"RANK(S419,$S:$S,0)+COUNTIF($S$3:S419,S419)-1","v":16},"Pittsburgh Steelers","Running Back"]
[{"$f":"RANK(S420,$S:$S,0)+COUNTIF($S$3:S420,S420)-1","v":16},"Pittsburgh Steelers","Running Back"]
[{"$f":"RANK(S421,$S:$S,0)+COUNTIF($S$3:S421,S421)-1","v":16},"Pittsburgh Steelers","Running Back"]
[{"$f":"RANK(S422,$S:$S,0)+COUNTIF($S$3:S422,S422)-1","v":16},"Pittsburgh Steelers","Running Back"]
[{"$f":"RANK(S423,$S:$S,0)+COUNTIF($S$3:S423,S423)-1","v":16},"Pittsburgh Steelers","Wide Receiver"]
[{"$f":"RANK(S424,$S:$S,0)+COUNTIF($S$3:S424,S424)-1","v":16},"Pittsburgh Steelers","Wide Receiver"]
[{"$f":"RANK(S425,$S:$S,0)+COUNTIF($S$3:S425,S425)-1","v":16},"Pittsburgh Steelers","Wide Receiver"]
[{"$f":"RANK(S426,$S:$S,0)+COUNTIF($S$3:S426,S426)-1","v":16},"Pittsburgh Steelers","Wide Receiver"]
[{"$f":"RANK(S427,$S:$S,0)+COUNTIF($S$3:S427,S427)-1","v":16},"Pittsburgh Steelers","Wide Receiver"]
[{"$f":"RANK(S428,$S:$S,0)+COUNTIF($S$3:S428,S428)-1","v":16},"Pittsburgh Steelers","Wide Receiver"]
[{"$f":"RANK(S429,$S:$S,0)+COUNTIF($S$3:S429,S429)-1","v":16},"Pittsburgh Steelers","Wide Receiver"]
[{"$f":"RANK(S430,$S:$S,0)+COUNTIF($S$3:S430,S430)-1","v":16},"Pittsburgh Steelers","Wide Receiver"]
[{"$f":"RANK(S431,$S:$S,0)+COUNTIF($S$3:S431,S431)-1","v":16},"Pittsburgh Steelers","Tight End"]
[{"$f":"RANK(S432,$S:$S,0)+COUNTIF($S$3:S432,S432)-1","v":16},"Pittsburgh Steelers","Tight End"]
[{"$f":"RANK(S433,$S:$S,0)+COUNTIF($S$3:S433,S433)-1","v":16},"Pittsburgh Steelers","Tight End"]
[{"$f":"RANK(S434,$S:$S,0)+COUNTIF($S$3:S434,S434)-1","v":16},"Pittsburgh Steelers","Tight End"]
[{"$f":"RANK(S435,$S:$S,0)+COUNTIF($S$3:S435,S435)-1","v":16},"San Francisco 49ers","Running Back"]
[{"$f":"RANK(S436,$S:$S,0)+COUNTIF($S$3:S436,S436)-1","v":16},"San Francisco 49ers","Running Back"]
[{"$f":"RANK(S437,$S:$S,0)+COUNTIF($S$3:S437,S437)-1","v":16},"San Francisco 49ers","Running Back"]
[{"$f":"RANK(S438,$S:$S,0)+COUNTIF($S$3:S438,S438)-1","v":16},"San Francisco 49ers","Running Back"]
[{"$f":"RANK(S439,$S:$S,0)+COUNTIF($S$3:S439,S439)-1","v":16},"San Francisco 49ers","Wide Receiver"]
[{"$f":"RANK(S440,$S:$S,0)+COUNTIF($S$3:S440,S440)-1","v":16},"San Francisco 49ers","Wide Receiver"]
[{"$f":"RANK(S441,$S:$S,0)+COUNTIF($S$3:S441,S441)-1","v":16},"San Francisco 49ers","Wide Receiver"]
[{"$f":"RANK(S442,$S:$S,0)+COUNTIF($S$3:S442,S442)-1","v":16},"San Francisco 49ers","Wide Receiver"]
[{"$f":"RANK(S443,$S:$S,0)+COUNTIF($S$3:S443,S443)-1","v":16},"San Francisco 49ers","Wide Receiver"]
[{"$f":"RANK(S444,$S:$S,0)+COUNTIF($S$3:S444,S444)-1","v":16},"San Francisco 49ers","Wide Receiver"]
[{"$f":"RANK(S445,$S:$S,0)+COUNTIF($S$3:S445,S445)-1","v":16},"San Francisco 49ers","Wide Receiver"]
[{"$f":"RANK(S446,$S:$S,0)+COUNTIF($S$3:S446,S446)-1","v":16},"San Francisco 49ers","Wide Receiver"]
[{"$f":"RANK(S447,$S:$S,0)+COUNTIF($S$3:S447,S447)-1","v":16},"San Francisco 49ers","Tight End"]
[{"$f":"RANK(S448,$S:$S,0)+COUNTIF($S$3:S448,S448)-1","v":16},"San Francisco 49ers","Tight End"]
[{"$f":"RANK(S449,$S:$S,0)+COUNTIF($S$3:S449,S449)-1","v":16},"San Francisco 49ers","Tight End"]
[{"$f":"RANK(S450,$S:$S,0)+COUNTIF($S$3:S450,S450)-1","v":16},"San Francisco 49ers","Tight End"]
[{"$f":"RANK(S451,$S:$S,0)+COUNTIF($S$3:S451,S451)-1","v":16},"Seattle Seahawks","Running Back"]
[{"$f":"RANK(S452,$S:$S,0)+COUNTIF($S$3:S452,S452)-1","v":16},"Seattle Seahawks","Running Back"]
[{"$f":"RANK(S453,$S:$S,0)+COUNTIF($S$3:S453,S453)-1","v":16},"Seattle Seahawks","Running Back"]
[{"$f":"RANK(S454,$S:$S,0)+COUNTIF($S$3:S454,S454)-1","v":16},"Seattle Seahawks","Running Back"]
[{"$f":"RANK(S455,$S:$S,0)+COUNTIF($S$3:S455,S455)-1","v":16},"Seattle Seahawks","Wide Receiver"]
[{"$f":"RANK(S456,$S:$S,0)+COUNTIF($S$3:S456,S456)-1","v":16},"Seattle Seahawks","Wide Receiver"]
[{"$f":"RANK(S457,$S:$S,0)+COUNTIF($S$3:S457,S457)-1","v":16},"Seattle Seahawks","Wide Receiver"]
[{"$f":"RANK(S458,$S:$S,0)+COUNTIF($S$3:S458,S458)-1","v":16},"Seattle Seahawks","Wide Receiver"]
[{"$f":"RANK(S459,$S:$S,0)+COUNTIF($S$3:S459,S459)-1","v":16},"Seattle Seahawks","Wide Receiver"]
[{"$f":"RANK(S460,$S:$S,0)+COUNTIF($S$3:S460,S460)-1","v":16},"Seattle Seahawks","Wide Receiver"]
[{"$f":"RANK(S461,$S:$S,0)+COUNTIF($S$3:S461,S461)-1","v":16},"Seattle Seahawks","Wide Receiver"]
[{"$f":"RANK(S462,$S:$S,0)+COUNTIF($S$3:S462,S462)-1","v":16},"Seattle Seahawks","Wide Receiver"]
[{"$f":"RANK(S463,$S:$S,0)+COUNTIF($S$3:S463,S463)-1","v":16},"Seattle Seahawks","Tight End"]
[{"$f":"RANK(S464,$S:$S,0)+COUNTIF($S$3:S464,S464)-1","v":16},"Seattle Seahawks","Tight End"]
[{"$f":"RANK(S465,$S:$S,0)+COUNTIF($S$3:S465,S465)-1","v":16},"Seattle Seahawks","Tight End"]
[{"$f":"RANK(S466,$S:$S,0)+COUNTIF($S$3:S466,S466)-1","v":16},"Seattle Seahawks","Tight End"]
[{"$f":"RANK(S467,$S:$S,0)+COUNTIF($S$3:S467,S467)-1","v":16},"Tampa Bay Buccaneers","Running Back"]
[{"$f":"RANK(S468,$S:$S,0)+COUNTIF($S$3:S468,S468)-1","v":16},"Tampa Bay Buccaneers","Running Back"]
[{"$f":"RANK(S469,$S:$S,0)+COUNTIF($S$3:S469,S469)-1","v":16},"Tampa Bay Buccaneers","Running Back"]
[{"$f":"RANK(S470,$S:$S,0)+COUNTIF($S$3:S470,S470)-1","v":16},"Tampa Bay Buccaneers","Running Back"]
[{"$f":"RANK(S471,$S:$S,0)+COUNTIF($S$3:S471,S471)-1","v":16},"Tampa Bay Buccaneers","Wide Receiver"]
[{"$f":"RANK(S472,$S:$S,0)+COUNTIF($S$3:S472,S472)-1","v":16},"Tampa Bay Buccaneers","Wide Receiver"]
[{"$f":"RANK(S473,$S:$S,0)+COUNTIF($S$3:S473,S473)-1","v":16},"Tampa Bay Buccaneers","Wide Receiver"]
[{"$f":"RANK(S474,$S:$S,0)+COUNTIF($S$3:S474,S474)-1","v":16},"Tampa Bay Buccaneers","Wide Receiver"]
[{"$f":"RANK(S475,$S:$S,0)+COUNTIF($S$3:S475,S475)-1","v":16},"Tampa Bay Buccaneers","Wide Receiver"]
[{"$f":"RANK(S476,$S:$S,0)+COUNTIF($S$3:S476,S476)-1","v":16},"Tampa Bay Buccaneers","Wide Receiver"]
[{"$f":"RANK(S477,$S:$S,0)+COUNTIF($S$3:S477,S477)-1","v":16},"Tampa Bay Buccaneers","Wide Receiver"]
[{"$f":"RANK(S478,$S:$S,0)+COUNTIF($S$3:S478,S478)-1","v":16},"Tampa Bay Buccaneers","Wide Receiver"]
[{"$f":"RANK(S479,$S:$S,0)+COUNTIF($S$3:S479,S479)-1","v":16},"Tampa Bay Buccaneers","Tight End"]
[{"$f":"RANK(S480,$S:$S,0)+COUNTIF($S$3:S480,S480)-1","v":16},"Tampa Bay Buccaneers","Tight End"]
[{"$f":"RANK(S481,$S:$S,0)+COUNTIF($S$3:S481,S481)-1","v":16},"Tampa Bay Buccaneers","Tight End"]
[{"$f":"RANK(S482,$S:$S,0)+COUNTIF($S$3:S482,S482)-1","v":16},"Tampa Bay Buccaneers","Tight End"]
[{"$f":"RANK(S483,$S:$S,0)+COUNTIF($S$3:S483,S483)-1","v":16},"Tennessee Titans","Running Back"]
[{"$f":"RANK(S484,$S:$S,0)+COUNTIF($S$3:S484,S484)-1","v":16},"Tennessee Titans","Running Back"]
[{"$f":"RANK(S485,$S:$S,0)+COUNTIF($S$3:S485,S485)-1","v":16},"Tennessee Titans","Running Back"]
[{"$f":"RANK(S486,$S:$S,0)+COUNTIF($S$3:S486,S486)-1","v":16},"Tennessee Titans","Running Back"]
[{"$f":"RANK(S487,$S:$S,0)+COUNTIF($S$3:S487,S487)-1","v":16},"Tennessee Titans","Wide Receiver"]
[{"$f":"RANK(S488,$S:$S,0)+COUNTIF($S$3:S488,S488)-1","v":16},"Tennessee Titans","Wide Receiver"]
[{"$f":"RANK(S489,$S:$S,0)+COUNTIF($S$3:S489,S489)-1","v":16},"Tennessee Titans","Wide Receiver"]
[{"$f":"RANK(S490,$S:$S,0)+COUNTIF($S$3:S490,S490)-1","v":16},"Tennessee Titans","Wide Receiver"]
[{"$f":"RANK(S491,$S:$S,0)+COUNTIF($S$3:S491,S491)-1","v":16},"Tennessee Titans","Wide Receiver"]
[{"$f":"RANK(S492,$S:$S,0)+COUNTIF($S$3:S492,S492)-1","v":16},"Tennessee Titans","Wide Receiver"]
[{"$f":"RANK(S493,$S:$S,0)+COUNTIF($S$3:S493,S493)-1","v":16},"Tennessee Titans","Wide Receiver"]
[{"$f":"RANK(S494,$S:$S,0)+COUNTIF($S$3:S494,S494)-1","v":16},"Tennessee Titans","Wide Receiver"]
[{"$f":"RANK(S495,$S:$S,0)+COUNTIF($S$3:S495,S495)-1","v":16},"Tennessee Titans","Tight End"]
[{"$f":"RANK(S496,$S:$S,0)+COUNTIF($S$3:S496,S496)-1","v":16},"Tennessee Titans","Tight End"]
[{"$f":"RANK(S497,$S:$S,0)+COUNTIF($S$3:S497,S497)-1","v":16},"Tennessee Titans","Tight End"]
[{"$f":"RANK(S498,$S:$S,0)+COUNTIF($S$3:S498,S498)-1","v":16},"Tennessee Titans","Tight End"]
[{"$f":"RANK(S499,$S:$S,0)+COUNTIF($S$3:S499,S499)-1","v":16},"Washington Commanders","Running Back"]
[{"$f":"RANK(S500,$S:$S,0)+COUNTIF($S$3:S500,S500)-1","v":16},"Washington Commanders","Running Back"]
[{"$f":"RANK(S501,$S:$S,0)+COUNTIF($S$3:S501,S501)-1","v":16},"Washington Commanders","Running Back"]
[{"$f":"RANK(S502,$S:$S,0)+COUNTIF($S$3:S502,S502)-1","v":16},"Washington Commanders","Running Back"]
[{"$f":"RANK(S503,$S:$S,0)+COUNTIF($S$3:S503,S503)-1","v":16},"Washington Commanders","Wide Receiver"]
[{"$f":"RANK(S504,$S:$S,0)+COUNTIF($S$3:S504,S504)-1","v":16},"Washington Commanders","Wide Receiver"]
[{"$f":"RANK(S505,$S:$S,0)+COUNTIF($S$3:S505,S505)-1","v":16},"Washington Commanders","Wide Receiver"]
[{"$f":"RANK(S506,$S:$S,0)+COUNTIF($S$3:S506,S506)-1","v":16},"Washington Commanders","Wide Receiver"]
[{"$f":"RANK(S507,$S:$S,0)+COUNTIF($S$3:S507,S507)-1","v":16},"Washington Commanders","Wide Receiver"]
[{"$f":"RANK(S508,$S:$S,0)+COUNTIF($S$3:S508,S508)-1","v":16},"Washington Commanders","Wide Receiver"]
[{"$f":"RANK(S509,$S:$S,0)+COUNTIF($S$3:S509,S509)-1","v":16},"Washington Commanders","Wide Receiver"]
[{"$f":"RANK(S510,$S:$S,0)+COUNTIF($S$3:S510,S510)-1","v":16},"Washington Commanders","Wide Receiver"]
[{"$f":"RANK(S511,$S:$S,0)+COUNTIF($S$3:S511,S511)-1","v":16},"Washington Commanders","Tight End"]
[{"$f":"RANK(S512,$S:$S,0)+COUNTIF($S$3:S512,S512)-1","v":16},"Washington Commanders","Tight End"]
[{"$f":"RANK(S513,$S:$S,0)+COUNTIF($S$3:S513,S513)-1","v":16},"Washington Commanders","Tight End"]
[{"$f":"RANK(S514,$S:$S,0)+COUNTIF($S$3:S514,S514)-1","v":16},"Washington Commanders","Tight End"]

{"sheet":"QB Projections","index":2,"n_rows":66,"n_cols":16,"rows_kept":66,"cut":false,"hidden":false,"merged":[]}
["Quarterback Projections"]
["Rank","Team","Player","Pass Att.","Completions","Pass Yds.","Pass TD","Int","Rush Att.","Rushing Yds","Rushing TDs","Fantasy Points (excl 1st down)","Fantasy Points (incl 1st down)","QB Completion %","QB TD %","YPA"]
[{"$f":"RANK(M3,$M:$M,0)+COUNTIF($M$3:M3,M3)-1","v":1},"Arizona Cardinals",{"$f":"'Arizona Cardinals'!$B$97","v":"Kyler Murray"},{"$f":"'Arizona Cardinals'!$C$97","v":538.428},{"$f":"'Arizona Cardinals'!$D$97","v":355.26371999999992},{"$f":"'Arizona Cardinals'!$E$97","v":3069.0279},{"$f":"'Arizona Cardinals'!$F$97","v":18},{"$f":"'Arizona Cardinals'!$G$97","v":7},{"$f":"'Arizona Cardinals'!$I$97","v":63.240000000000009},{"$f":"'Arizona Cardinals'!$K$97","v":392.08800000000008},{"$f":"'Arizona Cardinals'!$L$97","v":2},{"$f":"'Arizona Cardinals'!$P$97","v":231.96991600000001},{"$f":"L3+(((0.0572*J3)-2.646)*'Settings & Instructions'!$C$20)","v":231.96991600000001},{"$f":"'Arizona Cardinals'!$M$97","v":0.65981657714680497},{"$f":"'Arizona Cardinals'!$N$97","v":3.3430653680714968E-2},{"$f":"'Arizona Cardinals'!$O$97","v":5.6999782700751078}]
[{"$f":"RANK(M4,$M:$M,0)+COUNTIF($M$3:M4,M4)-1","v":2},"Arizona Cardinals",{"$f":"'Arizona Cardinals'!$B$98","v":"Colt McCoy"},{"$f":"'Arizona Cardinals'!$C$98","v":75},{"$f":"'Arizona Cardinals'!$D$98","v":46.5},{"$f":"'Arizona Cardinals'!$E$98","v":418.5},{"$f":"'Arizona Cardinals'!$F$98","v":4},{"$f":"'Arizona Cardinals'!$G$98","v":3},{"$f":"'Arizona Cardinals'!$I$98","v":21.080000000000005},{"$f":"'Arizona Cardinals'!$K$98","v":94.860000000000028},{"$f":"'Arizona Cardinals'!$L$98","v":0},{"$f":"'Arizona Cardinals'!$P$98","v":36.226000000000006},{"$f":"L4+(((0.0572*J4)-2.646)*'Settings & Instructions'!$C$20)","v":36.226000000000006},{"$f":"'Arizona Cardinals'!$M$98","v":0.62},{"$f":"'Arizona Cardinals'!$N$98","v":5.3333333333333337E-2},{"$f":"'Arizona Cardinals'!$O$98","v":5.58}]
[null,"Atlanta Falcons"]
[null,"Atlanta Falcons"]
[null,"Baltimore Ravens"]
[null,"Baltimore Ravens"]
[null,"Buffalo Bills"]
[null,"Buffalo Bills"]
[null,"Carolina Panthers"]
[null,"Carolina Panthers"]
[null,"Chicago Bears"]
[null,"Chicago Bears"]
[null,"Cincinnati Bengals"]
[null,"Cincinnati Bengals"]
[null,"Cleveland Browns"]
[null,"Cleveland Browns"]
[null,"Dallas Cowboys"]
[null,"Dallas Cowboys"]
[null,"Denver Broncos"]
[null,"Denver Broncos"]
[null,"Detroit Lions"]
[null,"Detroit Lions"]
[null,"Green Bay Packers"]
[null,"Green Bay Packers"]
[null,"Houston Texans"]
[null,"Houston Texans"]
[null,"Indianapolis Colts"]
[null,"Indianapolis Colts"]
[null,"Jacksonville Jaguars"]
[null,"Jacksonville Jaguars"]
[null,"Kansas City Chiefs"]
[null,"Kansas City Chiefs"]
[null,"Las Vegas Raiders"]
[null,"Las Vegas Raiders"]
[null,"Los Angeles Chargers"]
[null,"Los Angeles Chargers"]
[null,"Los Angeles Rams"]
[null,"Los Angeles Rams"]
[null,"Miami Dolphins"]
[null,"Miami Dolphins"]
[null,"Minnesota Vikings"]
[null,"Minnesota Vikings"]
[null,"New England Patriots"]
[null,"New England Patriots"]
[null,"New Orleans Saints"]
[null,"New Orleans Saints"]
[null,"New York Giants"]
[null,"New York Giants"]
[null,"New York Jets"]
[null,"New York Jets"]
[null,"Philadelphia Eagles"]
[null,"Philadelphia Eagles"]
[null,"Pittsburgh Steelers"]
[null,"Pittsburgh Steelers"]
[null,"San Francisco 49ers"]
[null,"San Francisco 49ers"]
[null,"Seattle Seahawks"]
[null,"Seattle Seahawks"]
[null,"Tampa Bay Buccaneers"]
[null,"Tampa Bay Buccaneers"]
[null,"Tennessee Titans"]
[null,"Tennessee Titans"]
[null,"Washington Commanders"]
[null,"Washington Commanders"]

{"sheet":"Total Rankings (excl QB)","index":3,"n_rows":514,"n_cols":9,"rows_kept":514,"cut":false,"hidden":false,"merged":[]}
["Total Rankings (Excl QB)"]
["Rank","Team","Position","Player","Fantasy Points","Pos Rank",null,"PPR & Premium Settings"]
[1,{"$f":"VLOOKUP($A3,'Total Projections (excl QB)'!$A:$T,2,0)","v":"Arizona Cardinals"},{"$f":"VLOOKUP($A3,'Total Projections (excl QB)'!$A:$T,3,0)","v":"Running Back"},{"$f":"VLOOKUP($A3,'Total Projections (excl QB)'!$A:$T,4,0)","v":"James Conner"},{"$f":"VLOOKUP($A3,'Total Projections (excl QB)'!$A:$T,19,0)","v":180.49560000000002},{"$f":"COUNTIFS(C:C,C3,E:E,\">\"&E3)+1","v":1}]
[2,{"$f":"VLOOKUP($A4,'Total Projections (excl QB)'!$A:$T,2,0)","v":"Arizona Cardinals"},{"$f":"VLOOKUP($A4,'Total Projections (excl QB)'!$A:$T,3,0)","v":"Tight End"},{"$f":"VLOOKUP($A4,'Total Projections (excl QB)'!$A:$T,4,0)","v":"Zach Ertz"},{"$f":"VLOOKUP($A4,'Total Projections (excl QB)'!$A:$T,19,0)","v":165.45038399999999},1,null,"Receptions",{"$f":"'Settings & Instructions'!C13","v":1}]
[3,{"$f":"VLOOKUP($A5,'Total Projections (excl QB)'!$A:$T,2,0)","v":"Arizona Cardinals"},{"$f":"VLOOKUP($A5,'Total Projections (excl QB)'!$A:$T,3,0)","v":"Wide Receiver"},{"$f":"VLOOKUP($A5,'Total Projections (excl QB)'!$A:$T,4,0)","v":"Marquise Brown"},{"$f":"VLOOKUP($A5,'Total Projections (excl QB)'!$A:$T,19,0)","v":161.42831999999999},1,null,"Premium - Tight End",{"$f":"'Settings & Instructions'!C14","v":1}]
[4,{"$f":"VLOOKUP($A6,'Total Projections (excl QB)'!$A:$T,2,0)","v":"Arizona Cardinals"},{"$f":"VLOOKUP($A6,'Total Projections (excl QB)'!$A:$T,3,0)","v":"Wide Receiver"},{"$f":"VLOOKUP($A6,'Total Projections (excl QB)'!$A:$T,4,0)","v":"DeAndre Hopkins"},{"$f":"VLOOKUP($A6,'Total Projections (excl QB)'!$A:$T,19,0)","v":157.18344000000002},2,null,"Premium - Wide Receiver",{"$f":"'Settings & Instructions'!C15","v":0}]
[5,{"$f":"VLOOKUP($A7,'Total Projections (excl QB)'!$A:$T,2,0)","v":"Arizona Cardinals"},{"$f":"VLOOKUP($A7,'Total Projections (excl QB)'!$A:$T,3,0)","v":"Tight End"},{"$f":"VLOOKUP($A7,'Total Projections (excl QB)'!$A:$T,4,0)","v":"Trey McBride"},{"$f":"VLOOKUP($A7,'Total Projections (excl QB)'!$A:$T,19,0)","v":125.28665999999998},2,null,"Premium - Running Back",{"$f":"'Settings & Instructions'!C16","v":0}]
[6,{"$f":"VLOOKUP($A8,'Total Projections (excl QB)'!$A:$T,2,0)","v":"Arizona Cardinals"},{"$f":"VLOOKUP($A8,'Total Projections (excl QB)'!$A:$T,3,0)","v":"Wide Receiver"},{"$f":"VLOOKUP($A8,'Total Projections (excl QB)'!$A:$T,4,0)","v":"Rondale Moore"},{"$f":"VLOOKUP($A8,'Total Projections (excl QB)'!$A:$T,19,0)","v":67.975200000000001},3]
[7,{"$f":"VLOOKUP($A9,'Total Projections (excl QB)'!$A:$T,2,0)","v":"Arizona Cardinals"},{"$f":"VLOOKUP($A9,'Total Projections (excl QB)'!$A:$T,3,0)","v":"Running Back"},{"$f":"VLOOKUP($A9,'Total Projections (excl QB)'!$A:$T,4,0)","v":"Keaontay Ingram"},{"$f":"VLOOKUP($A9,'Total Projections (excl QB)'!$A:$T,19,0)","v":60.773850000000003},2]
[8,{"$f":"VLOOKUP($A10,'Total Projections (excl QB)'!$A:$T,2,0)","v":"Arizona Cardinals"},{"$f":"VLOOKUP($A10,'Total Projections (excl QB)'!$A:$T,3,0)","v":"Running Back"},{"$f":"VLOOKUP($A10,'Total Projections (excl QB)'!$A:$T,4,0)","v":"Corey Clement"},{"$f":"VLOOKUP($A10,'Total Projections (excl QB)'!$A:$T,19,0)","v":58.544640000000001},3]
[9,{"$f":"VLOOKUP($A11,'Total Projections (excl QB)'!$A:$T,2,0)","v":"Arizona Cardinals"},{"$f":"VLOOKUP($A11,'Total Projections (excl QB)'!$A:$T,3,0)","v":"Wide Receiver"},{"$f":"VLOOKUP($A11,'Total Projections (excl QB)'!$A:$T,4,0)","v":"Greg Dortch"},{"$f":"VLOOKUP($A11,'Total Projections (excl QB)'!$A:$T,19,0)","v":57.793559999999999},4]
[10,{"$f":"VLOOKUP($A12,'Total Projections (excl QB)'!$A:$T,2,0)","v":"Arizona Cardinals"},{"$f":"VLOOKUP($A12,'Total Projections (excl QB)'!$A:$T,3,0)","v":"Wide Receiver"},{"$f":"VLOOKUP($A12,'Total Projections (excl QB)'!$A:$T,4,0)","v":"Zach Pascal"},{"$f":"VLOOKUP($A12,'Total Projections (excl QB)'!$A:$T,19,0)","v":27.628079999999997},5]
[11,{"$f":"VLOOKUP($A13,'Total Projections (excl QB)'!$A:$T,2,0)","v":"Arizona Cardinals"},{"$f":"VLOOKUP($A13,'Total Projections (excl QB)'!$A:$T,3,0)","v":"Wide Receiver"},{"$f":"VLOOKUP($A13,'Total Projections (excl QB)'!$A:$T,4,0)","v":"Michael Wilson"},{"$f":"VLOOKUP($A13,'Total Projections (excl QB)'!$A:$T,19,0)","v":21.683520000000001},6]
[12,{"$f":"VLOOKUP($A14,'Total Projections (excl QB)'!$A:$T,2,0)","v":"Arizona Cardinals"},{"$f":"VLOOKUP($A14,'Total Projections (excl QB)'!$A:$T,3,0)","v":"Running Back"},{"$f":"VLOOKUP($A14,'Total Projections (excl QB)'!$A:$T,4,0)","v":0},{"$f":"VLOOKUP($A14,'Total Projections (excl QB)'!$A:$T,19,0)","v":0},4]
[13,{"$f":"VLOOKUP($A15,'Total Projections (excl QB)'!$A:$T,2,0)","v":"Arizona Cardinals"},{"$f":"VLOOKUP($A15,'Total Projections (excl QB)'!$A:$T,3,0)","v":"Wide Receiver"},{"$f":"VLOOKUP($A15,'Total Projections (excl QB)'!$A:$T,4,0)","v":0},{"$f":"VLOOKUP($A15,'Total Projections (excl QB)'!$A:$T,19,0)","v":0},7]
[14,{"$f":"VLOOKUP($A16,'Total Projections (excl QB)'!$A:$T,2,0)","v":"Arizona Cardinals"},{"$f":"VLOOKUP($A16,'Total Projections (excl QB)'!$A:$T,3,0)","v":"Wide Receiver"},{"$f":"VLOOKUP($A16,'Total Projections (excl QB)'!$A:$T,4,0)","v":0},{"$f":"VLOOKUP($A16,'Total Projections (excl QB)'!$A:$T,19,0)","v":0},7]
[15,{"$f":"VLOOKUP($A17,'Total Projections (excl QB)'!$A:$T,2,0)","v":"Arizona Cardinals"},{"$f":"VLOOKUP($A17,'Total Projections (excl QB)'!$A:$T,3,0)","v":"Tight End"},{"$f":"VLOOKUP($A17,'Total Projections (excl QB)'!$A:$T,4,0)","v":0},{"$f":"VLOOKUP($A17,'Total Projections (excl QB)'!$A:$T,19,0)","v":0},3]
[16,{"$f":"VLOOKUP($A18,'Total Projections (excl QB)'!$A:$T,2,0)","v":"Arizona Cardinals"},{"$f":"VLOOKUP($A18,'Total Projections (excl QB)'!$A:$T,3,0)","v":"Tight End"},{"$f":"VLOOKUP($A18,'Total Projections (excl QB)'!$A:$T,4,0)","v":0},{"$f":"VLOOKUP($A18,'Total Projections (excl QB)'!$A:$T,19,0)","v":0},3]
[17]
[18]
[19]
[20]
[21]
[22]
[23]
[24]
[25]
[26]
[27]
[28]
[29]
[30]
[31]
[32]
[33]
[34]
[35]
[36]
[37]
[38]
[39]
[40]
[41]
[42]
[43]
[44]
[45]
[46]
[47]
[48]
[49]
[50]
[51]
[52]
[53]
[54]
[55]
[56]
[57]
[58]
[59]
[60]
[61]
[62]
[63]
[64]
[65]
[66]
[67]
[68]
[69]
[70]
[71]
[72]
[73]
[74]
[75]
[76]
[77]
[78]
[79]
[80]
[81]
[82]
[83]
[84]
[85]
[86]
[87]
[88]
[89]
[90]
[91]
[92]
[93]
[94]
[95]
[96]
[97]
[98]
[99]
[100]
[101]
[102]
[103]
[104]
[105]
[106]
[107]
[108]
[109]
[110]
[111]
[112]
[113]
[114]
[115]
[116]
[117]
[118]
[119]
[120]
[121]
[122]
[123]
[124]
[125]
[126]
[127]
[128]
[129]
[130]
[131]
[132]
[133]
[134]
[135]
[136]
[137]
[138]
[139]
[140]
[141]
[142]
[143]
[144]
[145]
[146]
[147]
[148]
[149]
[150]
[151]
[152]
[153]
[154]
[155]
[156]
[157]
[158]
[159]
[160]
[161]
[162]
[163]
[164]
[165]
[166]
[167]
[168]
[169]
[170]
[171]
[172]
[173]
[174]
[175]
[176]
[177]
[178]
[179]
[180]
[181]
[182]
[183]
[184]
[185]
[186]
[187]
[188]
[189]
[190]
[191]
[192]
[193]
[194]
[195]
[196]
[197]
[198]
[199]
[200]
[201]
[202]
[203]
[204]
[205]
[206]
[207]
[208]
[209]
[210]
[211]
[212]
[213]
[214]
[215]
[216]
[217]
[218]
[219]
[220]
[221]
[222]
[223]
[224]
[225]
[226]
[227]
[228]
[229]
[230]
[231]
[232]
[233]
[234]
[235]
[236]
[237]
[238]
[239]
[240]
[241]
[242]
[243]
[244]
[245]
[246]
[247]
[248]
[249]
[250]
[251]
[252]
[253]
[254]
[255]
[256]
[257]
[258]
[259]
[260]
[261]
[262]
[263]
[264]
[265]
[266]
[267]
[268]
[269]
[270]
[271]
[272]
[273]
[274]
[275]
[276]
[277]
[278]
[279]
[280]
[281]
[282]
[283]
[284]
[285]
[286]
[287]
[288]
[289]
[290]
[291]
[292]
[293]
[294]
[295]
[296]
[297]
[298]
[299]
[300]
[301]
[302]
[303]
[304]
[305]
[306]
[307]
[308]
[309]
[310]
[311]
[312]
[313]
[314]
[315]
[316]
[317]
[318]
[319]
[320]
[321]
[322]
[323]
[324]
[325]
[326]
[327]
[328]
[329]
[330]
[331]
[332]
[333]
[334]
[335]
[336]
[337]
[338]
[339]
[340]
[341]
[342]
[343]
[344]
[345]
[346]
[347]
[348]
[349]
[350]
[351]
[352]
[353]
[354]
[355]
[356]
[357]
[358]
[359]
[360]
[361]
[362]
[363]
[364]
[365]
[366]
[367]
[368]
[369]
[370]
[371]
[372]
[373]
[374]
[375]
[376]
[377]
[378]
[379]
[380]
[381]
[382]
[383]
[384]
[385]
[386]
[387]
[388]
[389]
[390]
[391]
[392]
[393]
[394]
[395]
[396]
[397]
[398]
[399]
[400]
[401]
[402]
[403]
[404]
[405]
[406]
[407]
[408]
[409]
[410]
[411]
[412]
[413]
[414]
[415]
[416]
[417]
[418]
[419]
[420]
[421]
[422]
[423]
[424]
[425]
[426]
[427]
[428]
[429]
[430]
[431]
[432]
[433]
[434]
[435]
[436]
[437]
[438]
[439]
[440]
[441]
[442]
[443]
[444]
[445]
[446]
[447]
[448]
[449]
[450]
[451]
[452]
[453]
[454]
[455]
[456]
[457]
[458]
[459]
[460]
[461]
[462]
[463]
[464]
[465]
[466]
[467]
[468]
[469]
[470]
[471]
[472]
[473]
[474]
[475]
[476]
[477]
[478]
[479]
[480]
[481]
[482]
[483]
[484]
[485]
[486]
[487]
[488]
[489]
[490]
[491]
[492]
[493]
[494]
[495]
[496]
[497]
[498]
[499]
[500]
[501]
[502]
[503]
[504]
[505]
[506]
[507]
[508]
[509]
[510]
[511]
[512]

{"sheet":"QB Rankings","index":4,"n_rows":66,"n_cols":4,"rows_kept":66,"cut":false,"hidden":false,"merged":[]}
["Quarterback Projections"]
["Rank","Team","Player","Fantasy Points"]
[1,{"$f":"VLOOKUP($A3,'QB Projections'!$A:$M,2,0)","v":"Arizona Cardinals"},{"$f":"VLOOKUP($A3,'QB Projections'!$A:$M,3,0)","v":"Kyler Murray"},{"$f":"VLOOKUP($A3,'QB Projections'!$A:$M,13,0)","v":231.96991600000001}]
[2,{"$f":"VLOOKUP($A4,'QB Projections'!$A:$M,2,0)","v":"Arizona Cardinals"},{"$f":"VLOOKUP($A4,'QB Projections'!$A:$M,3,0)","v":"Colt McCoy"},{"$f":"VLOOKUP($A4,'QB Projections'!$A:$M,13,0)","v":36.226000000000006}]
[3]
[4]
[5]
[6]
[7]
[8]
[9]
[10]
[11]
[12]
[13]
[14]
[15]
[16]
[17]
[18]
[19]
[20]
[21]
[22]
[23]
[24]
[25]
[26]
[27]
[28]
[29]
[30]
[31]
[32]
[33]
[34]
[35]
[36]
[37]
[38]
[39]
[40]
[41]
[42]
[43]
[44]
[45]
[46]
[47]
[48]
[49]
[50]
[51]
[52]
[53]
[54]
[55]
[56]
[57]
[58]
[59]
[60]
[61]
[62]
[63]
[64]

{"sheet":"Positional Ranks","index":5,"n_rows":194,"n_cols":23,"rows_kept":194,"cut":false,"hidden":false,"merged":[]}
["Wide Receiver",null,null,null,null,null,"Running Back",null,null,null,null,null,"Tight End",null,null,null,null,null,"Quarterback"]
["Rank","Player","Fantasy Points","Points per Game","Tier",null,"Rank","Player","Fantasy Points","Points per Game","Tier",null,"Rank","Player","Fantasy Points","Points per Game","Tier",null,"Rank","Player","Fantasy Points","Points per Game","Tier"]
[1,{"$f":"INDEX('Total Rankings (excl QB)'!$D:$D,MATCH(1,(\"Wide Receiver\"='Total Rankings (excl QB)'!$C:$C)*(A3='Total Rankings (excl QB)'!$F:$F),0),1)","v":"Marquise Brown"},{"$f":"VLOOKUP($B3,'Total Rankings (excl QB)'!$D:$E,2,0)","v":161.42831999999999},{"$f":"C3/17","v":9.4957835294117636},null,null,1,{"$f":"INDEX('Total Rankings (excl QB)'!$D:$D,MATCH(1,(\"Running Back\"='Total Rankings (excl QB)'!$C:$C)*(G3='Total Rankings (excl QB)'!$F:$F),0),1)","v":"James Conner"},{"$f":"VLOOKUP($H3,'Total Rankings (excl QB)'!$D:$E,2,0)","v":180.49560000000002},{"$f":"I3/17","v":10.617388235294118},null,null,1,{"$f":"INDEX('Total Rankings (excl QB)'!$D:$D,MATCH(1,(\"Tight End\"='Total Rankings (excl QB)'!$C:$C)*(M3='Total Rankings (excl QB)'!$F:$F),0),1)","v":"Zach Ertz"},{"$f":"VLOOKUP($N3,'Total Rankings (excl QB)'!$D:$E,2,0)","v":165.45038399999999},{"$f":"O3/17","v":9.7323755294117635},null,null,1,{"$f":"'QB Rankings'!C3","v":"Kyler Murray"},{"$f":"'QB Rankings'!D3","v":231.96991600000001},{"$f":"U3/17","v":13.645289176470589}]
[2,{"$f":"INDEX('Total Rankings (excl QB)'!$D:$D,MATCH(1,(\"Wide Receiver\"='Total Rankings (excl QB)'!$C:$C)*(A4='Total Rankings (excl QB)'!$F:$F),0),1)","v":"DeAndre Hopkins"},{"$f":"VLOOKUP($B4,'Total Rankings (excl QB)'!$D:$E,2,0)","v":157.18344000000002},{"$f":"C4/17","v":9.2460847058823532},null,null,2,{"$f":"INDEX('Total Rankings (excl QB)'!$D:$D,MATCH(1,(\"Running Back\"='Total Rankings (excl QB)'!$C:$C)*(G4='Total Rankings (excl QB)'!$F:$F),0),1)","v":"Keaontay Ingram"},{"$f":"VLOOKUP($H4,'Total Rankings (excl QB)'!$D:$E,2,0)","v":60.773850000000003},{"$f":"I4/17","v":3.5749323529411767},null,null,2,{"$f":"INDEX('Total Rankings (excl QB)'!$D:$D,MATCH(1,(\"Tight End\"='Total Rankings (excl QB)'!$C:$C)*(M4='Total Rankings (excl QB)'!$F:$F),0),1)","v":"Trey McBride"},{"$f":"VLOOKUP($N4,'Total Rankings (excl QB)'!$D:$E,2,0)","v":125.28665999999998},{"$f":"O4/17","v":7.3698035294117634},null,null,2,{"$f":"'QB Rankings'!C4","v":"Colt McCoy"},{"$f":"'QB Rankings'!D4","v":36.226000000000006},{"$f":"U4/17","v":2.1309411764705888}]
[3,{"$f":"INDEX('Total Rankings (excl QB)'!$D:$D,MATCH(1,(\"Wide Receiver\"='Total Rankings (excl QB)'!$C:$C)*(A5='Total Rankings (excl QB)'!$F:$F),0),1)","v":"Rondale Moore"},{"$f":"VLOOKUP($B5,'Total Rankings (excl QB)'!$D:$E,2,0)","v":67.975200000000001},3.9985411764705883,null,null,3,{"$f":"INDEX('Total Rankings (excl QB)'!$D:$D,MATCH(1,(\"Running Back\"='Total Rankings (excl QB)'!$C:$C)*(G5='Total Rankings (excl QB)'!$F:$F),0),1)","v":"Corey Clement"},{"$f":"VLOOKUP($H5,'Total Rankings (excl QB)'!$D:$E,2,0)","v":58.544640000000001},3.4438023529411765,null,null,3,null,null,null,null,null,3]
[4,{"$f":"INDEX('Total Rankings (excl QB)'!$D:$D,MATCH(1,(\"Wide Receiver\"='Total Rankings (excl QB)'!$C:$C)*(A6='Total Rankings (excl QB)'!$F:$F),0),1)","v":"Greg Dortch"},{"$f":"VLOOKUP($B6,'Total Rankings (excl QB)'!$D:$E,2,0)","v":57.793559999999999},3.3996211764705881,null,null,4,null,null,null,null,null,4,null,null,null,null,null,4]
[5,{"$f":"INDEX('Total Rankings (excl QB)'!$D:$D,MATCH(1,(\"Wide Receiver\"='Total Rankings (excl QB)'!$C:$C)*(A7='Total Rankings (excl QB)'!$F:$F),0),1)","v":"Zach Pascal"},{"$f":"VLOOKUP($B7,'Total Rankings (excl QB)'!$D:$E,2,0)","v":27.628079999999997},1.6251811764705881,null,null,5,null,null,null,null,null,5,null,null,null,null,null,5]
[6,{"$f":"INDEX('Total Rankings (excl QB)'!$D:$D,MATCH(1,(\"Wide Receiver\"='Total Rankings (excl QB)'!$C:$C)*(A8='Total Rankings (excl QB)'!$F:$F),0),1)","v":"Michael Wilson"},{"$f":"VLOOKUP($B8,'Total Rankings (excl QB)'!$D:$E,2,0)","v":21.683520000000001},1.2755011764705884,null,null,6,null,null,null,null,null,6,null,null,null,null,null,6]
[7,null,null,null,null,null,7,null,null,null,null,null,7,null,null,null,null,null,7]
[8,null,null,null,null,null,8,null,null,null,null,null,8,null,null,null,null,null,8]
[9,null,null,null,null,null,9,null,null,null,null,null,9,null,null,null,null,null,9]
[10,null,null,null,null,null,10,null,null,null,null,null,10,null,null,null,null,null,10]
[11,null,null,null,null,null,11,null,null,null,null,null,11,null,null,null,null,null,11]
[12,null,null,null,null,null,12,null,null,null,null,null,12,null,null,null,null,null,12]
[13,null,null,null,null,null,13,null,null,null,null,null,13,null,null,null,null,null,13]
[14,null,null,null,null,null,14,null,null,null,null,null,14,null,null,null,null,null,14]
[15,null,null,null,null,null,15,null,null,null,null,null,15,null,null,null,null,null,15]
[16,null,null,null,null,null,16,null,null,null,null,null,16,null,null,null,null,null,16]
[17,null,null,null,null,null,17,null,null,null,null,null,17,null,null,null,null,null,17]
[18,null,null,null,null,null,18,null,null,null,null,null,18,null,null,null,null,null,18]
[19,null,null,null,null,null,19,null,null,null,null,null,19,null,null,null,null,null,19]
[20,null,null,null,null,null,20,null,null,null,null,null,20,null,null,null,null,null,20]
[21,null,null,null,null,null,21,null,null,null,null,null,21,null,null,null,null,null,21]
[22,null,null,null,null,null,22,null,null,null,null,null,22,null,null,null,null,null,22]
[23,null,null,null,null,null,23,null,null,null,null,null,23,null,null,null,null,null,23]
[24,null,null,null,null,null,24,null,null,null,null,null,24,null,null,null,null,null,24]
[25,null,null,null,null,null,25,null,null,null,null,null,25,null,null,null,null,null,25]
[26,null,null,null,null,null,26,null,null,null,null,null,26,null,null,null,null,null,26]
[27,null,null,null,null,null,27,null,null,null,null,null,27,null,null,null,null,null,27]
[28,null,null,null,null,null,28,null,null,null,null,null,28,null,null,null,null,null,28]
[29,null,null,null,null,null,29,null,null,null,null,null,29,null,null,null,null,null,29]
[30,null,null,null,null,null,30,null,null,null,null,null,30,null,null,null,null,null,30]
[31,null,null,null,null,null,31,null,null,null,null,null,31,null,null,null,null,null,31]
[32,null,null,null,null,null,32,null,null,null,null,null,32,null,null,null,null,null,32]
[33,null,null,null,null,null,33,null,null,null,null,null,33,null,null,null,null,null,33]
[34,null,null,null,null,null,34,null,null,null,null,null,34,null,null,null,null,null,34]
[35,null,null,null,null,null,35,null,null,null,null,null,35,null,null,null,null,null,35]
[36,null,null,null,null,null,36,null,null,null,null,null,36,null,null,null,null,null,36]
[37,null,null,null,null,null,37,null,null,null,null,null,37,null,null,null,null,null,37]
[38,null,null,null,null,null,38,null,null,null,null,null,38,null,null,null,null,null,38]
[39,null,null,null,null,null,39,null,null,null,null,null,39,null,null,null,null,null,39]
[40,null,null,null,null,null,40,null,null,null,null,null,40,null,null,null,null,null,40]
[41,null,null,null,null,null,41,null,null,null,null,null,41,null,null,null,null,null,41]
[42,null,null,null,null,null,42,null,null,null,null,null,42,null,null,null,null,null,42]
[43,null,null,null,null,null,43,null,null,null,null,null,43,null,null,null,null,null,43]
[44,null,null,null,null,null,44,null,null,null,null,null,44,null,null,null,null,null,44]
[45,null,null,null,null,null,45,null,null,null,null,null,45,null,null,null,null,null,45]
[46,null,null,null,null,null,46,null,null,null,null,null,46,null,null,null,null,null,46]
[47,null,null,null,null,null,47,null,null,null,null,null,47,null,null,null,null,null,47]
[48,null,null,null,null,null,48,null,null,null,null,null,48,null,null,null,null,null,48]
[49,null,null,null,null,null,49,null,null,null,null,null,49,null,null,null,null,null,49]
[50,null,null,null,null,null,50,null,null,null,null,null,50,null,null,null,null,null,50]
[51,null,null,null,null,null,51,null,null,null,null,null,51,null,null,null,null,null,51]
[52,null,null,null,null,null,52,null,null,null,null,null,52,null,null,null,null,null,52]
[53,null,null,null,null,null,53,null,null,null,null,null,53,null,null,null,null,null,53]
[54,null,null,null,null,null,54,null,null,null,null,null,54,null,null,null,null,null,54]
[55,null,null,null,null,null,55,null,null,null,null,null,55,null,null,null,null,null,55]
[56,null,null,null,null,null,56,null,null,null,null,null,56,null,null,null,null,null,56]
[57,null,null,null,null,null,57,null,null,null,null,null,57,null,null,null,null,null,57]
[58,null,null,null,null,null,58,null,null,null,null,null,58,null,null,null,null,null,58]
[59,null,null,null,null,null,59,null,null,null,null,null,59,null,null,null,null,null,59]
[60,null,null,null,null,null,60,null,null,null,null,null,60,null,null,null,null,null,60]
[61,null,null,null,null,null,61,null,null,null,null,null,61,null,null,null,null,null,61]
[62,null,null,null,null,null,62,null,null,null,null,null,62,null,null,null,null,null,62]
[63,null,null,null,null,null,63,null,null,null,null,null,63,null,null,null,null,null,63]
[64,null,null,null,null,null,64,null,null,null,null,null,64,null,null,null,null,null,64]
[65,null,null,null,null,null,65,null,null,null,null,null,65]
[66,null,null,null,null,null,66,null,null,null,null,null,66]
[67,null,null,null,null,null,67,null,null,null,null,null,67]
[68,null,null,null,null,null,68,null,null,null,null,null,68]
[69,null,null,null,null,null,69,null,null,null,null,null,69]
[70,null,null,null,null,null,70,null,null,null,null,null,70]
[71,null,null,null,null,null,71,null,null,null,null,null,71]
[72,null,null,null,null,null,72,null,null,null,null,null,72]
[73,null,null,null,null,null,73,null,null,null,null,null,73]
[74,null,null,null,null,null,74,null,null,null,null,null,74]
[75,null,null,null,null,null,75,null,null,null,null,null,75]
[76,null,null,null,null,null,76,null,null,null,null,null,76]
[77,null,null,null,null,null,77,null,null,null,null,null,77]
[78,null,null,null,null,null,78,null,null,null,null,null,78]
[79,null,null,null,null,null,79,null,null,null,null,null,79]
[80,null,null,null,null,null,80,null,null,null,null,null,80]
[81,null,null,null,null,null,81,null,null,null,null,null,81]
[82,null,null,null,null,null,82,null,null,null,null,null,82]
[83,null,null,null,null,null,83,null,null,null,null,null,83]
[84,null,null,null,null,null,84,null,null,null,null,null,84]
[85,null,null,null,null,null,85,null,null,null,null,null,85]
[86,null,null,null,null,null,86,null,null,null,null,null,86]
[87,null,null,null,null,null,87,null,null,null,null,null,87]
[88,null,null,null,null,null,88,null,null,null,null,null,88]
[89,null,null,null,null,null,89,null,null,null,null,null,89]
[90,null,null,null,null,null,90,null,null,null,null,null,90]
[91,null,null,null,null,null,91,null,null,null,null,null,91]
[92,null,null,null,null,null,92,null,null,null,null,null,92]
[93,null,null,null,null,null,93,null,null,null,null,null,93]
[94,null,null,null,null,null,94,null,null,null,null,null,94]
[95,null,null,null,null,null,95,null,null,null,null,null,95]
[96,null,null,null,null,null,96,null,null,null,null,null,96]
[97,null,null,null,null,null,97,null,null,null,null,null,97]
[98,null,null,null,null,null,98,null,null,null,null,null,98]
[99,null,null,null,null,null,99,null,null,null,null,null,99]
[100,null,null,null,null,null,100,null,null,null,null,null,100]
[101,null,null,null,null,null,101,null,null,null,null,null,101]
[102,null,null,null,null,null,102,null,null,null,null,null,102]
[103,null,null,null,null,null,103,null,null,null,null,null,103]
[104,null,null,null,null,null,104,null,null,null,null,null,104]
[105,null,null,null,null,null,105,null,null,null,null,null,105]
[106,null,null,null,null,null,106,null,null,null,null,null,106]
[107,null,null,null,null,null,107,null,null,null,null,null,107]
[108,null,null,null,null,null,108,null,null,null,null,null,108]
[109,null,null,null,null,null,109,null,null,null,null,null,109]
[110,null,null,null,null,null,110,null,null,null,null,null,110]
[111,null,null,null,null,null,111,null,null,null,null,null,111]
[112,null,null,null,null,null,112,null,null,null,null,null,112]
[113,null,null,null,null,null,113,null,null,null,null,null,113]
[114,null,null,null,null,null,114,null,null,null,null,null,114]
[115,null,null,null,null,null,115,null,null,null,null,null,115]
[116,null,null,null,null,null,116,null,null,null,null,null,116]
[117,null,null,null,null,null,117,null,null,null,null,null,117]
[118,null,null,null,null,null,118,null,null,null,null,null,118]
[119,null,null,null,null,null,119,null,null,null,null,null,119]
[120,null,null,null,null,null,120,null,null,null,null,null,120]
[121,null,null,null,null,null,121,null,null,null,null,null,121]
[122,null,null,null,null,null,122,null,null,null,null,null,122]
[123,null,null,null,null,null,123,null,null,null,null,null,123]
[124,null,null,null,null,null,124,null,null,null,null,null,124]
[125,null,null,null,null,null,125,null,null,null,null,null,125]
[126,null,null,null,null,null,126,null,null,null,null,null,126]
[127,null,null,null,null,null,127,null,null,null,null,null,127]
[128,null,null,null,null,null,128,null,null,null,null,null,128]
[129]
[130]
[131]
[132]
[133]
[134]
[135]
[136]
[137]
[138]
[139]
[140]
[141]
[142]
[143]
[144]
[145]
[146]
[147]
[148]
[149]
[150]
[151]
[152]
[153]
[154]
[155]
[156]
[157]
[158]
[159]
[160]
[161]
[162]
[163]
[164]
[165]
[166]
[167]
[168]
[169]
[170]
[171]
[172]
[173]
[174]
[175]
[176]
[177]
[178]
[179]
[180]
[181]
[182]
[183]
[184]
[185]
[186]
[187]
[188]
[189]
[190]
[191]
[192]

{"sheet":"To Hide","index":6,"n_rows":23,"n_cols":8,"rows_kept":23,"cut":false,"hidden":true,"merged":[]}
["Wide Receivers",null,null,"Select Rankings",{"$f":"#REF!","v":{"$error":"#REF!"}}]
["Running Backs"]
["Tight Ends"]
["Quarterbacks"]
[]
[]
[]
[null,null,null,null,null,null,null,{"$f":"E1","v":{"$error":"#REF!"}}]
[null,null,null,null,null,null,1,{"$f":"IFERROR(IF($E$1=$A$1,VLOOKUP(G9,'Positional Ranks'!A:B,2,0),IF($E$1=$A$2,VLOOKUP(G9,'Positional Ranks'!G:H,2,0),IF($E$1=$A$3,VLOOKUP(G9,'Positional Ranks'!M:N,2,0),IF($E$1=$A$4,VLOOKUP(G9,'Positional Ranks'!S:T,2,0),\"PROJECTIONS INCOMPLETE\")))),\"PROJECTIONS INCOMPLETE\")","v":"PROJECTIONS INCOMPLETE"}]
[null,null,null,null,null,null,2,{"$f":"IFERROR(IF($E$1=$A$1,VLOOKUP(G10,'Positional Ranks'!A:B,2,0),IF($E$1=$A$2,VLOOKUP(G10,'Positional Ranks'!G:H,2,0),IF($E$1=$A$3,VLOOKUP(G10,'Positional Ranks'!M:N,2,0),IF($E$1=$A$4,VLOOKUP(G10,'Positional Ranks'!S:T,2,0),\"PROJECTIONS INCOMPLETE\")))),\"PROJECTIONS INCOMPLETE\")","v":"PROJECTIONS INCOMPLETE"}]
[null,null,null,null,null,null,3,{"$f":"IFERROR(IF($E$1=$A$1,VLOOKUP(G11,'Positional Ranks'!A:B,2,0),IF($E$1=$A$2,VLOOKUP(G11,'Positional Ranks'!G:H,2,0),IF($E$1=$A$3,VLOOKUP(G11,'Positional Ranks'!M:N,2,0),IF($E$1=$A$4,VLOOKUP(G11,'Positional Ranks'!S:T,2,0),\"PROJECTIONS INCOMPLETE\")))),\"PROJECTIONS INCOMPLETE\")","v":"PROJECTIONS INCOMPLETE"}]
[null,null,null,null,null,null,4,{"$f":"IFERROR(IF($E$1=$A$1,VLOOKUP(G12,'Positional Ranks'!A:B,2,0),IF($E$1=$A$2,VLOOKUP(G12,'Positional Ranks'!G:H,2,0),IF($E$1=$A$3,VLOOKUP(G12,'Positional Ranks'!M:N,2,0),IF($E$1=$A$4,VLOOKUP(G12,'Positional Ranks'!S:T,2,0),\"PROJECTIONS INCOMPLETE\")))),\"PROJECTIONS INCOMPLETE\")","v":"PROJECTIONS INCOMPLETE"}]
[null,null,null,null,null,null,5,{"$f":"IFERROR(IF($E$1=$A$1,VLOOKUP(G13,'Positional Ranks'!A:B,2,0),IF($E$1=$A$2,VLOOKUP(G13,'Positional Ranks'!G:H,2,0),IF($E$1=$A$3,VLOOKUP(G13,'Positional Ranks'!M:N,2,0),IF($E$1=$A$4,VLOOKUP(G13,'Positional Ranks'!S:T,2,0),\"PROJECTIONS INCOMPLETE\")))),\"PROJECTIONS INCOMPLETE\")","v":"PROJECTIONS INCOMPLETE"}]
[null,null,null,null,null,null,6,{"$f":"IFERROR(IF($E$1=$A$1,VLOOKUP(G14,'Positional Ranks'!A:B,2,0),IF($E$1=$A$2,VLOOKUP(G14,'Positional Ranks'!G:H,2,0),IF($E$1=$A$3,VLOOKUP(G14,'Positional Ranks'!M:N,2,0),IF($E$1=$A$4,VLOOKUP(G14,'Positional Ranks'!S:T,2,0),\"PROJECTIONS INCOMPLETE\")))),\"PROJECTIONS INCOMPLETE\")","v":"PROJECTIONS INCOMPLETE"}]
[null,null,null,null,null,null,7,{"$f":"IFERROR(IF($E$1=$A$1,VLOOKUP(G15,'Positional Ranks'!A:B,2,0),IF($E$1=$A$2,VLOOKUP(G15,'Positional Ranks'!G:H,2,0),IF($E$1=$A$3,VLOOKUP(G15,'Positional Ranks'!M:N,2,0),IF($E$1=$A$4,VLOOKUP(G15,'Positional Ranks'!S:T,2,0),\"PROJECTIONS INCOMPLETE\")))),\"PROJECTIONS INCOMPLETE\")","v":"PROJECTIONS INCOMPLETE"}]
[null,null,null,null,null,null,8,{"$f":"IFERROR(IF($E$1=$A$1,VLOOKUP(G16,'Positional Ranks'!A:B,2,0),IF($E$1=$A$2,VLOOKUP(G16,'Positional Ranks'!G:H,2,0),IF($E$1=$A$3,VLOOKUP(G16,'Positional Ranks'!M:N,2,0),IF($E$1=$A$4,VLOOKUP(G16,'Positional Ranks'!S:T,2,0),\"PROJECTIONS INCOMPLETE\")))),\"PROJECTIONS INCOMPLETE\")","v":"PROJECTIONS INCOMPLETE"}]
[null,null,null,null,null,null,9,{"$f":"IFERROR(IF($E$1=$A$1,VLOOKUP(G17,'Positional Ranks'!A:B,2,0),IF($E$1=$A$2,VLOOKUP(G17,'Positional Ranks'!G:H,2,0),IF($E$1=$A$3,VLOOKUP(G17,'Positional Ranks'!M:N,2,0),IF($E$1=$A$4,VLOOKUP(G17,'Positional Ranks'!S:T,2,0),\"PROJECTIONS INCOMPLETE\")))),\"PROJECTIONS INCOMPLETE\")","v":"PROJECTIONS INCOMPLETE"}]
[null,null,null,null,null,null,10,{"$f":"IFERROR(IF($E$1=$A$1,VLOOKUP(G18,'Positional Ranks'!A:B,2,0),IF($E$1=$A$2,VLOOKUP(G18,'Positional Ranks'!G:H,2,0),IF($E$1=$A$3,VLOOKUP(G18,'Positional Ranks'!M:N,2,0),IF($E$1=$A$4,VLOOKUP(G18,'Positional Ranks'!S:T,2,0),\"PROJECTIONS INCOMPLETE\")))),\"PROJECTIONS INCOMPLETE\")","v":"PROJECTIONS INCOMPLETE"}]
[null,null,null,null,null,null,11,{"$f":"IFERROR(IF($E$1=$A$1,VLOOKUP(G19,'Positional Ranks'!A:B,2,0),IF($E$1=$A$2,VLOOKUP(G19,'Positional Ranks'!G:H,2,0),IF($E$1=$A$3,VLOOKUP(G19,'Positional Ranks'!M:N,2,0),IF($E$1=$A$4,VLOOKUP(G19,'Positional Ranks'!S:T,2,0),\"PROJECTIONS INCOMPLETE\")))),\"PROJECTIONS INCOMPLETE\")","v":"PROJECTIONS INCOMPLETE"}]
[null,null,null,null,null,null,12,{"$f":"IFERROR(IF($E$1=$A$1,VLOOKUP(G20,'Positional Ranks'!A:B,2,0),IF($E$1=$A$2,VLOOKUP(G20,'Positional Ranks'!G:H,2,0),IF($E$1=$A$3,VLOOKUP(G20,'Positional Ranks'!M:N,2,0),IF($E$1=$A$4,VLOOKUP(G20,'Positional Ranks'!S:T,2,0),\"PROJECTIONS INCOMPLETE\")))),\"PROJECTIONS INCOMPLETE\")","v":"PROJECTIONS INCOMPLETE"}]
[]
[null,null,null,null,null,null,null,{"$f":"IF('Settings & Instructions'!C13=1,\"PPR\",IF('Settings & Instructions'!C13=0.5,\"Half-PPR\",IF('Settings & Instructions'!C13=0,\"Non-PPR\",\"\")))","v":"PPR"}]
[null,null,null,null,null,null,null,{"$f":"IF(H8=\"Tight Ends\",IF('Settings & Instructions'!C14=0,\"\",'Settings & Instructions'!C14&\" x Tight End Premium\"),\"\")","v":{"$error":"#REF!"}}]

{"sheet":"Arizona Cardinals","index":7,"n_rows":705,"n_cols":26,"rows_kept":705,"cut":false,"hidden":false,"merged":[[26,9,27,9]]}
[null,null,null,"*If the file is running slow, ensure Calculation Options (under the Formulas menu) is set to 'Manual'. Then Press F9 to Calculate at any time*"]
[]
[null,null,"ARI"]
[null,null,null,null,null,"2023 Schedule",null,null,null,"2022 Results"]
[null,null,"Arizona Cardinals",null,null,"Week","@","Opponent",null,"Team Totals","Opponent","Off Plays","Pass Att","Rush Att","Pass %",null,"Total TDs","Pass TDs","Rush TDs","Pass TD %"]
[null,null,null,null,null,"Week 1","@","Washington Commanders",null,"Week 1","Kansas City Chiefs",60,38,22,0.6333333333333333,null,3,2,1,0.66666666666666663]
[null,null,null,null,null,"Week 2","","New York Giants",null,"Week 2","@ Las Vegas Raiders",77,49,28,0.63636363636363635,null,3,1,2,0.33333333333333331]
[null,"Head Coach",null,"Jonathan Gannon",null,"Week 3","","Dallas Cowboys",null,"Week 3","Los Angeles Rams",79,58,21,0.73417721518987344,null,0,0,0,{"$error":"#DIV/0!"}]
[null,"Offensive Coordinator",null,"Drew Petzing",null,"Week 4","@","San Francisco 49ers",null,"Week 4","@ Carolina Panthers",69,32,37,0.46376811594202899,null,3,2,1,0.66666666666666663]
[null,null,null,null,null,"Week 5","","Cincinnati Bengals",null,"Week 5","Philadelphia Eagles",68,42,26,0.61764705882352944,null,2,1,1,0.5]
[null,"Division",null,"NFC West",null,"Week 6","@","Los Angeles Rams",null,"Week 6","@ Seattle Seahawks",65,37,28,0.56923076923076921,null,0,0,0,{"$error":"#DIV/0!"}]
[null,"Last Season Finish",null,"4-13",null,"Week 7","@","Seattle Seahawks",null,"Week 7","New Orleans Saints",58,29,29,0.5,null,3,1,2,0.33333333333333331]
[null,null,null,null,null,"Week 8","","Baltimore Ravens",null,"Week 8","@ Minnesota Vikings",66,44,22,0.66666666666666663,null,3,3,0,1]
[null,null,null,null,null,"Week 9","@","Cleveland Browns",null,"Week 9","Seattle Seahawks",56,35,21,0.625,null,2,2,0,1]
[null,"Top Projected Players",null,null,null,"Week 10","","Atlanta Falcons",null,"Week 10","@ Los Angeles Rams",63,37,26,0.58730158730158732,null,3,1,2,0.33333333333333331]
[null,null,null,null,null,"Week 11","@","Houston Texans",null,"Week 11","San Francisco 49ers",68,44,24,0.6470588235294118,null,1,0,1,0]
[null,{"$f":"INDEX($B$97:$S$145,MATCH(1,$S$97:$S$145,0),1)","v":"Kyler Murray"},{"$f":"INDEX($B$97:$Q$145,MATCH(B17,$B$97:$B$145,0),16)","v":"QB1"},{"$f":"INDEX($B$97:$R$145,MATCH(B17,$B$97:$B$145,0),17)","v":"Top QB"},null,"Week 12","","Los Angeles Rams",null,"Week 12","Los Angeles Chargers",63,29,34,0.46031746031746029,null,3,2,1,0.66666666666666663]
[null,{"$f":"INDEX($B$97:$S$145,MATCH(2,$S$97:$S$145,0),1)","v":"James Conner"},{"$f":"INDEX($B$97:$Q$145,MATCH(B18,$B$97:$B$145,0),16)","v":"RB1"},{"$f":"INDEX($B$97:$R$145,MATCH(B18,$B$97:$B$145,0),17)","v":"Consistent RB2"},null,"Week 13","@","Pittsburgh Steelers",null,"Week 13","BYE"]
[null,{"$f":"INDEX($B$97:$S$145,MATCH(3,$S$97:$S$145,0),1)","v":"Zach Ertz"},{"$f":"INDEX($B$97:$Q$145,MATCH(B19,$B$97:$B$145,0),16)","v":"TE1"},"Not a top TE",null,"Week 14","","Bye Week",null,"Week 14","New England Patriots",63,41,22,0.65079365079365081,null,1,0,1,0]
[null,{"$f":"INDEX($B$97:$S$145,MATCH(4,$S$97:$S$145,0),1)","v":"Marquise Brown"},{"$f":"INDEX($B$97:$Q$145,MATCH(B20,$B$97:$B$145,0),16)","v":"WR1"},"Consistent WR2",null,"Week 15","","San Francisco 49ers",null,"Week 15","@ Denver Broncos",56,36,20,0.6428571428571429,null,1,0,1,0]
[null,{"$f":"INDEX($B$97:$S$145,MATCH(5,$S$97:$S$145,0),1)","v":"DeAndre Hopkins"},{"$f":"INDEX($B$97:$Q$145,MATCH(B21,$B$97:$B$145,0),16)","v":"WR2"},"Consistent WR2",null,"Week 16","@","Chicago Bears",null,"Week 16","Tampa Bay Buccaneers",73,46,27,0.63013698630136983,null,1,0,1,0]
[null,null,null,null,null,"Week 17","@","Philadelphia Eagles",null,"Week 17","@ Atlanta Falcons",67,40,27,0.59701492537313428,null,1,1,0,1]
[null,null,null,null,null,"Week 18","","Seattle Seahawks",null,"Week 18","@ San Francisco 49ers",47,27,20,0.57446808510638303,null,2,1,1,0.5]
[]
[null,"Team Projection",null,"STEP 1: Project the total team plays and pass % expectation",null,null,null,null,null,"Total",null,1098,664,434,0.60473588342440798,null,32,17,15,0.53125]
[]
[null,null,"Off Plays","Pass %",null,"Pass Plays","Run Plays",null,null,"2022 League Averages","Full Season",{"$f":"M27+N27","v":1027},565,462,{"$f":"M27/L27","v":0.55014605647517045},null,{"$f":"R27+S27","v":38},23,15,{"$f":"R27/Q27","v":0.60526315789473684}]
[null,"Per Game",62,0.6,null,{"$f":"C28*D28","v":37.199999999999996},{"$f":"C28-F28","v":24.800000000000004},null,null,null,"Per Game",{"$f":"L27/17","v":60.411764705882355},{"$f":"M27/17","v":33.235294117647058},27.176470588235293,{"$f":"O27","v":0.55014605647517045},null,{"$f":"Q27/17","v":2.2352941176470589},1.3529411764705883,0.88235294117647056,{"$f":"T27","v":0.60526315789473684}]
[null,"Full Season",{"$f":"C28*17","v":1054},null,null,{"$f":"F28*17","v":632.4},{"$f":"G28*17","v":421.60000000000008}]
[null,null,null,null,null,null,null,null,null,"2021 Total",null,1087,591,496,0.54369825206991718,null,50,27,23,0.54]
[null,"Throwaway %",0.03,null,"Throwaway Relevant Data",null,null,null,null,"2020 Total",null,1054,575,479,0.54554079696394686,null,49,27,22,0.55102040816326525]
[null,null,null,null,"League Average",null,3.9E-2,null,null,"2019 Total",null,950,554,396,0.5831578947368421,null,38,20,18,0.52631578947368418]
[null,null,null,null,"Last Season",null,{"$f":"SUMIFS(INPUTS!CF:CF,INPUTS!BW:BW,$C$3)/SUMIFS(INPUTS!CC:CC,INPUTS!BW:BW,$C$3)","v":3.9156626506024098E-2}]
[]
[]
[]
[null,"Team Wins and Touchdown Expectation",null,null,null,null,"OPTIONAL STEP: Project the expected team wins and the Low/High range of team wins"]
[null,null,null,null,null,null,null,null,"Low","High"]
[null,null,null,null,"Team Wins Projection",5.5,null,"Range of Outcomes"]
[null,null,null,null,"Expected Team Touchdowns",{"$f":"VLOOKUP(F39,INPUTS!$A$1:$B$34,2,0)","v":30},null,"Expected Team Touchdowns"]
[]
[null,null,null,null,"Current Team Touchdown Projection",{"$f":"L97+L98+SUM(N108:N117)+SUM(I108:I117)+SUM(I127:I130)+SUM(N127:N130)+SUM(N142:N145)+SUM(I142:I145)","v":31},"Note: This section is intended to give you a guide on the expected number of team touchdowns, based on the projected team win total - the more games a team wins, the more touchdowns they'll score"]
[null,null,null,null,null,null,"In the range of outcomes, you can set the low & high ends of expected team wins to see the impact on players expected fantasy points. Remember, it's just a guide!"]
[null,"(Expand if needed - click the + on the left)"]
[]
[]
[null,"Supporting Info"]
[]
[null,"Last Season","(Click the + to see Last Season details and Key Changes from this offseason)",null,null,null,null,null,null,"Key Changes & Need to Know"]
[]
[null,null,null,null,null,null,null,null,null,"New Head Coach - Jonathan Gannon, former Eagles Defensive Coordinator. Worked under Nick Siriani (Eagles), Frank Reich (Colts), and Mike Zimmer (Vikings)"]
[]
[null,null,null,null,null,null,null,null,null,"New Offensive Coordinator - Drew Petzing, former Cleveland Browns Quarterbacks Coach. Worked under Kevin Stefanski (Cleveland) and Mike Zimmer (Vikings)"]
[]
[null,null,null,null,null,null,null,null,null,"Kyler Murray Injury - suffered a torn ACL in December 2022, which is expected to impact his 2023 season"]
[]
[null,null,null,null,null,null,null,null,null,"Free Agency - Notable New Players",null,null,null,null,"Free Agency - Notable Players who have left"]
[]
[null,null,null,null,null,null,null,null,null,"Zach Pascal - Wide Receiver",null,null,null,null,"Maxx Williams - Tight End",null,null,null,"A.J. Green - Wide Receiver (Retired)"]
[null,null,null,null,null,null,null,null,null,"Kelvin Beachum - Offensive Tackle",null,null,null,null,"Billy Price - Center",null,null,null,"J.J. Watt - Defensive End (Retired)"]
[null,null,null,null,null,null,null,null,null,null,null,null,null,null,null,null,null,null,"Chosen Anderson - Wide Receiver"]
[null,null,null,null,null,null,null,null,null,"Drafted Players"]
[]
[null,null,null,null,null,null,null,null,null,1.06,"Paris Johnson Jr.","OT",null,6.03,"Kei'Trel Clark",null,"CB"]
[null,null,null,null,null,null,null,null,null,2.1,"BJ Ojulari","EDGE",null,6.36,"Dante Stills",null,"DT"]
[null,null,null,null,null,null,null,null,null,3.03,"Sydney Brown","DB"]
[null,null,null,null,null,null,null,null,null,3.09,"Garrett Williams","CB"]
[null,null,null,null,null,null,null,null,null,3.31,"Michael Wilson","WR"]
[null,null,null,null,null,null,null,null,null,4.2,"Jon Gaines II","G"]
[null,null,null,null,null,null,null,null,null,5.04,"Clayton Tune","QB"]
[null,null,null,null,null,null,null,null,null,5.33,"Owen Pappoe","LB"]
[]
[null,null,null,null,null,null,null,null,null,"Expectations"]
[]
[null,null,null,null,null,null,null,null,null,"Heading for the number one pick in 2024, 2023 is not going to be a good year for the Cardinals. This is going to mean lower scoring, less touchdowns and lower upsides for the players"]
[null,null,null,null,null,null,null,null,null,"Petzing is a somewhat unknown commodity for play calling but with negative gamescripts likely, the Cardinals will need to continue passing the ball even without the air raid approach"]
[null,null,null,null,null,null,null,null,null,"Strengthened the tackle position in the draft but Kyler is likely to miss games so it's going to be a hard slog"]
[]
[null,null,null,null,null,null,null,null,null,"Vegas Win-Total"]
[]
[null,null,null,null,null,null,null,null,null,"5.5 Wins"]
[]
[]
[]
[null,"Player Projections",null,null,null,null,null,"*If the file is running slow, ensure Calculation Options (under the Formulas menu) is set to 'Manual'. Then Press F9 to Calculate at any time*"]
[]
[null,"Target Share And Rush Share Checks",null,null,null,null,"CHECK: For the Projections to work correctly, these %'s should be at 0% - if they're not then you need to reallocate the target / rush shares until they reach 0%"]
[]
[null,null,null,null,"Remaining Target Share to distribute:",{"$f":"1-C31-SUM(C108:C117)-SUM(C127:C132)-SUM(C142:C147)","v":0},null,null,null,null,null,null,"Remaining Rush Share to distribute (remember QB Rush Share):",{"$f":"1-SUM(H97:H98)-SUM(J108:J117)-SUM(J127:J132)-SUM(J142:J147)","v":0}]
[]
[]
[]
[null,"Quarterbacks",null,"Note: White Cells will populate automatically",null,null,null,null,"STEP 2: Project the individual player stats in the light blue cells"]
[null,"(Click the + on the left to expand)",null,"Quarterback Passing populates from receiving stats",null,null,null,null,"Ensure 100% of target share and rush share - see above checks",null,null,null,null,null,null,null,null,null,null,"Range of Outcomes"]
[null,null,null,"Project Interceptions and Rushing Stats only for Quarterback",null,null,null,null,null,null,null,null,null,null,null,null,null,null,null,"Low",null,"High"]
[null,"Player","Pass Att.","Completions","Pass Yds.","Pass TD","Int","Rush Att Share %","Rush Att.","Yards Per Carry","Rushing Yds","Rushing TDs","QB Completion %","QB TD %","YPA","Fantasy Points","Positional Rank","Tier \n(Volume Based)",null,"Fantasy Points","Tier","Fantasy Points","Tier"]
[null,"Kyler Murray",{"$f":"SUM(D108:D117)+SUM(D127:D132)+SUM(D142:D147)-C98","v":538.428},{"$f":"SUM(F108:F117)+SUM(F127:F132)+SUM(F142:F147)-D98","v":355.26371999999992},{"$f":"SUM(H108:H117)+SUM(H127:H132)+SUM(H142:H147)-E98","v":3069.0279},{"$f":"SUM(I108:I117)+SUM(I127:I132)+SUM(I142:I147)-F98","v":18},7,0.15,{"$f":"H97*$G$29","v":63.240000000000009},6.2,{"$f":"I97*J97","v":392.08800000000008},2,{"$f":"IFERROR(D97/C97,0)","v":0.65981657714680497},{"$f":"IFERROR(F97/C97,0)","v":3.3430653680714968E-2},{"$f":"IFERROR(E97/C97,0)","v":5.6999782700751078},{"$f":"(E97*'Settings & Instructions'!$C$8)+(F97*'Settings & Instructions'!$C$7)+(G97*'Settings & Instructions'!$C$9)+(K97*'Settings & Instructions'!$C$17)+(L97*'Settings & Instructions'!$C$12)+(D97*'Settings & Instructions'!$C$10)+((C97-D97)*'Settings & Instructions'!$C$11)","v":231.96991600000001},{"$f":"IFERROR(\"QB\"&INDEX('Positional Ranks'!$S:$T,MATCH($B97,'Positional Ranks'!$T:$T,0),1),\"\")","v":"QB1"},{"$f":"IF(I97>(INPUTS!$CZ$5-1),\"Top QB\",IF(AND(C97>(INPUTS!$CZ$6-1),I97>(INPUTS!$DA$6-1)),\"Top QB\",IF(C97>(INPUTS!$CZ$7-1),\"2nd Tier QB1\",\"Not a top QB\")))","v":"Top QB"},{"$f":"RANK(P97,($P$97:$P$98,$P$108:$P$115,$P$127:$P$130,$P$142:$P$145),0)","v":1}]
[null,"Colt McCoy",75,{"$f":"C98*0.62","v":46.5},{"$f":"D98*9","v":418.5},4,3,0.05,{"$f":"H98*$G$29","v":21.080000000000005},4.5,{"$f":"I98*J98","v":94.860000000000028},0,{"$f":"IFERROR(D98/C98,0)","v":0.62},{"$f":"IFERROR(F98/C98,0)","v":5.3333333333333337E-2},{"$f":"IFERROR(E98/C98,0)","v":5.58},{"$f":"(E98*'Settings & Instructions'!$C$8)+(F98*'Settings & Instructions'!$C$7)+(G98*'Settings & Instructions'!$C$9)+(K98*'Settings & Instructions'!$C$17)+(L98*'Settings & Instructions'!$C$12)+(D98*'Settings & Instructions'!$C$10)+((C98-D98)*'Settings & Instructions'!$C$11)","v":36.226000000000006},{"$f":"IFERROR(\"QB\"&INDEX('Positional Ranks'!$S:$T,MATCH($B98,'Positional Ranks'!$T:$T,0),1),\"\")","v":"QB2"},null,{"$f":"RANK(P98,($P$97:$P$98,$P$108:$P$115,$P$127:$P$130,$P$142:$P$145),0)","v":11}]
[]
[null,"Last Season Data Check",null,"Use this section to see last season's stats as a guide or comparison",null,null,null,null,null,null,null,null,null,null,null,null,"Games Played"]
[null,{"$f":"B97","v":"Kyler Murray"},{"$f":"IFERROR(VLOOKUP($B$101,INPUTS!$F:$AI,9,0),\"N/A\")","v":390},{"$f":"IFERROR(VLOOKUP($B$101,INPUTS!$F:$AI,8,0),\"N/A\")","v":259},{"$f":"IFERROR(VLOOKUP($B$101,INPUTS!$F:$AI,11,0),\"N/A\")","v":2368},{"$f":"IFERROR(VLOOKUP($B$101,INPUTS!$F:$AI,12,0),\"N/A\")","v":14},{"$f":"IFERROR(VLOOKUP($B$101,INPUTS!$F:$AI,14,0),\"N/A\")","v":7},{"$f":"IFERROR(INDEX($E$487:$Z$507,21,MATCH($B101,$E$487:$Z$487,0)),\"N/A\")","v":0.15437788018433179},{"$f":"IFERROR(VLOOKUP($B$101,INPUTS!$AL:$AY,7,0),\"N/A\")","v":67},{"$f":"IFERROR(VLOOKUP($B$101,INPUTS!$AL:$AY,12,0),\"N/A\")","v":6.2},{"$f":"IFERROR(VLOOKUP($B$101,INPUTS!$AL:$AY,8,0),\"N/A\")","v":418},{"$f":"IFERROR(VLOOKUP($B$101,INPUTS!$AL:$AY,9,0),\"N/A\")","v":3},{"$f":"IFERROR(VLOOKUP($B$101,INPUTS!$F:$AI,10,0)/100,\"N/A\")","v":0.66400000000000003},{"$f":"IFERROR(VLOOKUP($B$101,INPUTS!$F:$AI,13,0)/100,\"N/A\")","v":3.6000000000000004E-2},{"$f":"IFERROR(VLOOKUP($B$101,INPUTS!$F:$AI,18,0),\"N/A\")","v":6.1},{"$f":"IFERROR((E101*'Settings & Instructions'!$C$8),0)+IFERROR((F101*'Settings & Instructions'!$C$7),0)+IFERROR((G101*'Settings & Instructions'!$C$9),0)+IFERROR((K101*'Settings & Instructions'!$C$17),0)+IFERROR((L101*'Settings & Instructions'!$C$12),0)+IFERROR((D101*'Settings & Instructions'!$C$10),0)+IFERROR(((C101-D101)*'Settings & Instructions'!$C$11),0)","v":196.52},{"$f":"IFERROR(VLOOKUP($B$101,INPUTS!$F:$AI,5,0),\"N/A\")","v":11}]
[]
[]
[null,"Wide Receivers",null,"Note: White Cells will populate automatically",null,null,null,null,"STEP 2: Project the individual player stats in the light blue cells"]
[null,"(Click the + on the left to expand)",null,null,null,null,null,null,"Ensure 100% of target share and rush share - see above checks",null,null,null,null,null,null,null,null,null,null,"Range of Outcomes"]
[null,null,null,null,null,null,null,null,null,null,null,null,null,null,null,null,null,null,null,"Low",null,"High"]
[null,"Player","Target Share %","Targets","Catch %","Receptions","Yards per Reception","Receiving Yards","Receiving TDs","Rush Att Share %","Rush Att","Yards per Carry","Rushing Yards","Rushing TDs","Premium","Fantasy Points","Positional Rank","Tier \n(Volume Based)",null,"Fantasy Points","Tier","Fantasy Points","Tier"]
[null,"Marquise Brown",0.18,{"$f":"C108*$F$29","v":113.83199999999999},0.63,{"$f":"D108*E108","v":71.714159999999993},10,{"$f":"G108*F108","v":717.14159999999993},3,null,{"$f":"J108*$G$29","v":0},null,{"$f":"L108*K108","v":0},null,{"$f":"'Settings & Instructions'!$C$15","v":0},{"$f":"(F108*'Settings & Instructions'!$C$13)+(H108*'Settings & Instructions'!$C$18)+(I108*'Settings & Instructions'!$C$19)+(M108*'Settings & Instructions'!$C$17)+(N108*'Settings & Instructions'!$C$12)+(O108*F108)","v":161.42831999999999},{"$f":"IFERROR(\"WR\"&INDEX('Positional Ranks'!$A:$B,MATCH($B108,'Positional Ranks'!$B:$B,0),1),\"\")","v":"WR1"},{"$f":"IF(D108>(INPUTS!$CP$5-1),\"Elite WR\",IF(D108>(INPUTS!$CP$6-1),\"2nd Tier WR1\",IF(D108>(INPUTS!$CP$7-1),\"Consistent WR2\",\"Not a top WR\")))","v":"Consistent WR2"},{"$f":"RANK(P108,($P$97:$P$98,$P$108:$P$115,$P$127:$P$130,$P$142:$P$145),0)","v":4}]
[null,"DeAndre Hopkins",0.18,{"$f":"C109*$F$29","v":113.83199999999999},0.6,{"$f":"D109*E109","v":68.299199999999999},9.5,648.8424,4,null,{"$f":"J109*$G$29","v":0},null,{"$f":"L109*K109","v":0},null,{"$f":"'Settings & Instructions'!$C$15","v":0},{"$f":"(F109*'Settings & Instructions'!$C$13)+(H109*'Settings & Instructions'!$C$18)+(I109*'Settings & Instructions'!$C$19)+(M109*'Settings & Instructions'!$C$17)+(N109*'Settings & Instructions'!$C$12)+(O109*F109)","v":157.18344000000002},{"$f":"IFERROR(\"WR\"&INDEX('Positional Ranks'!$A:$B,MATCH($B109,'Positional Ranks'!$B:$B,0),1),\"\")","v":"WR2"},{"$f":"IF(D109>(INPUTS!$CP$5-1),\"Elite WR\",IF(D109>(INPUTS!$CP$6-1),\"2nd Tier WR1\",IF(D109>(INPUTS!$CP$7-1),\"Consistent WR2\",\"Not a top WR\")))","v":"Consistent WR2"},{"$f":"RANK(P109,($P$97:$P$98,$P$108:$P$115,$P$127:$P$130,$P$142:$P$145),0)","v":5}]
[null,"Greg Dortch",7.0000000000000007E-2,44.268000000000001,0.65,28.7742,8,230.1936,1,null,0,null,0,null,{"$f":"'Settings & Instructions'!$C$15","v":0},{"$f":"(F110*'Settings & Instructions'!$C$13)+(H110*'Settings & Instructions'!$C$18)+(I110*'Settings & Instructions'!$C$19)+(M110*'Settings & Instructions'!$C$17)+(N110*'Settings & Instructions'!$C$12)+(O110*F110)","v":57.793559999999999},{"$f":"IFERROR(\"WR\"&INDEX('Positional Ranks'!$A:$B,MATCH($B110,'Positional Ranks'!$B:$B,0),1),\"\")","v":"WR4"},{"$f":"IF(D110>(INPUTS!$CP$5-1),\"Elite WR\",IF(D110>(INPUTS!$CP$6-1),\"2nd Tier WR1\",IF(D110>(INPUTS!$CP$7-1),\"Consistent WR2\",\"Not a top WR\")))","v":"Not a top WR"},{"$f":"RANK(P110,($P$97:$P$98,$P$108:$P$115,$P$127:$P$130,$P$142:$P$145),0)","v":10}]
[null,"Rondale Moore",7.0000000000000007E-2,44.268000000000001,0.7,30.987599999999997,10,309.87599999999998,1,null,0,null,0,null,{"$f":"'Settings & Instructions'!$C$15","v":0},{"$f":"(F111*'Settings & Instructions'!$C$13)+(H111*'Settings & Instructions'!$C$18)+(I111*'Settings & Instructions'!$C$19)+(M111*'Settings & Instructions'!$C$17)+(N111*'Settings & Instructions'!$C$12)+(O111*F111)","v":67.975200000000001},{"$f":"IFERROR(\"WR\"&INDEX('Positional Ranks'!$A:$B,MATCH($B111,'Positional Ranks'!$B:$B,0),1),\"\")","v":"WR3"},{"$f":"IF(D111>(INPUTS!$CP$5-1),\"Elite WR\",IF(D111>(INPUTS!$CP$6-1),\"2nd Tier WR1\",IF(D111>(INPUTS!$CP$7-1),\"Consistent WR2\",\"Not a top WR\")))","v":"Not a top WR"},{"$f":"RANK(P111,($P$97:$P$98,$P$108:$P$115,$P$127:$P$130,$P$142:$P$145),0)","v":7}]
[null,"Zach Pascal",0.03,18.971999999999998,0.6,{"$f":"D112*E112","v":11.383199999999999},9,{"$f":"G112*F112","v":102.44879999999999},1,null,0,null,{"$f":"L112*K112","v":0},null,{"$f":"'Settings & Instructions'!$C$15","v":0},{"$f":"(F112*'Settings & Instructions'!$C$13)+(H112*'Settings & Instructions'!$C$18)+(I112*'Settings & Instructions'!$C$19)+(M112*'Settings & Instructions'!$C$17)+(N112*'Settings & Instructions'!$C$12)+(O112*F112)","v":27.628079999999997},{"$f":"IFERROR(\"WR\"&INDEX('Positional Ranks'!$A:$B,MATCH($B112,'Positional Ranks'!$B:$B,0),1),\"\")","v":"WR5"},{"$f":"IF(D112>(INPUTS!$CP$5-1),\"Elite WR\",IF(D112>(INPUTS!$CP$6-1),\"2nd Tier WR1\",IF(D112>(INPUTS!$CP$7-1),\"Consistent WR2\",\"Not a top WR\")))","v":"Not a top WR"},{"$f":"RANK(P112,($P$97:$P$98,$P$108:$P$115,$P$127:$P$130,$P$142:$P$145),0)","v":12}]
[null,"Michael Wilson",0.02,12.648,0.62,7.8417599999999998,10,78.417599999999993,1,null,0,null,0,null,{"$f":"'Settings & Instructions'!$C$15","v":0},{"$f":"(F113*'Settings & Instructions'!$C$13)+(H113*'Settings & Instructions'!$C$18)+(I113*'Settings & Instructions'!$C$19)+(M113*'Settings & Instructions'!$C$17)+(N113*'Settings & Instructions'!$C$12)+(O113*F113)","v":21.683520000000001},{"$f":"IFERROR(\"WR\"&INDEX('Positional Ranks'!$A:$B,MATCH($B113,'Positional Ranks'!$B:$B,0),1),\"\")","v":"WR6"},{"$f":"IF(D113>(INPUTS!$CP$5-1),\"Elite WR\",IF(D113>(INPUTS!$CP$6-1),\"2nd Tier WR1\",IF(D113>(INPUTS!$CP$7-1),\"Consistent WR2\",\"Not a top WR\")))","v":"Not a top WR"},{"$f":"RANK(P113,($P$97:$P$98,$P$108:$P$115,$P$127:$P$130,$P$142:$P$145),0)","v":13}]
[null,null,null,0,null,0,null,0,null,null,0,null,0,null,{"$f":"'Settings & Instructions'!$C$15","v":0},{"$f":"(F114*'Settings & Instructions'!$C$13)+(H114*'Settings & Instructions'!$C$18)+(I114*'Settings & Instructions'!$C$19)+(M114*'Settings & Instructions'!$C$17)+(N114*'Settings & Instructions'!$C$12)+(O114*F114)","v":0},{"$f":"IFERROR(\"WR\"&INDEX('Positional Ranks'!$A:$B,MATCH($B114,'Positional Ranks'!$B:$B,0),1),\"\")","v":""},{"$f":"IF(D114>(INPUTS!$CP$5-1),\"Elite WR\",IF(D114>(INPUTS!$CP$6-1),\"2nd Tier WR1\",IF(D114>(INPUTS!$CP$7-1),\"Consistent WR2\",\"Not a top WR\")))","v":"Not a top WR"},{"$f":"RANK(P114,($P$97:$P$98,$P$108:$P$115,$P$127:$P$130,$P$142:$P$145),0)","v":14}]
[null,null,null,0,null,0,null,0,null,null,0,null,0,null,{"$f":"'Settings & Instructions'!$C$15","v":0},{"$f":"(F115*'Settings & Instructions'!$C$13)+(H115*'Settings & Instructions'!$C$18)+(I115*'Settings & Instructions'!$C$19)+(M115*'Settings & Instructions'!$C$17)+(N115*'Settings & Instructions'!$C$12)+(O115*F115)","v":0},{"$f":"IFERROR(\"WR\"&INDEX('Positional Ranks'!$A:$B,MATCH($B115,'Positional Ranks'!$B:$B,0),1),\"\")","v":""},{"$f":"IF(D115>(INPUTS!$CP$5-1),\"Elite WR\",IF(D115>(INPUTS!$CP$6-1),\"2nd Tier WR1\",IF(D115>(INPUTS!$CP$7-1),\"Consistent WR2\",\"Not a top WR\")))","v":"Not a top WR"},{"$f":"RANK(P115,($P$97:$P$98,$P$108:$P$115,$P$127:$P$130,$P$142:$P$145),0)","v":14}]
[]
[null,"Other",0.03,{"$f":"C117*$F$29","v":18.971999999999998},0.6,11.383199999999999,10,113.83199999999999,1,null,{"$f":"J117*$G$29","v":0},null,0,null,{"$f":"'Settings & Instructions'!$C$15","v":0},{"$f":"(F117*'Settings & Instructions'!$C$13)+(H117*'Settings & Instructions'!$C$18)+(I117*'Settings & Instructions'!$C$19)+(M117*'Settings & Instructions'!$C$17)+(N117*'Settings & Instructions'!$C$12)+(O117*F117)","v":28.766399999999997}]
[]
[null,"Last Season Data Check",null,"Use this section to see last season's stats as a guide or comparison",null,null,null,null,null,null,null,null,null,null,null,null,"Games Played"]
[null,"Marquise Brown",{"$f":"IFERROR(INDEX($E$179:$Z$199,21,MATCH($B120,$E$179:$Z$179,0)),\"N/A\")","v":0.16114457831325302},{"$f":"IFERROR(VLOOKUP($B120,INPUTS!$BB:$BS,7,0),\"N/A\")","v":107},{"$f":"IFERROR(VLOOKUP($B120,INPUTS!$BB:$BS,9,0),\"N/A\")","v":0.626},{"$f":"IFERROR(VLOOKUP($B120,INPUTS!$BB:$BS,8,0),\"N/A\")","v":67},{"$f":"IFERROR(VLOOKUP($B120,INPUTS!$BB:$BS,11,0),\"N/A\")","v":10.6},{"$f":"IFERROR(VLOOKUP($B120,INPUTS!$BB:$BS,10,0),\"N/A\")","v":709},{"$f":"IFERROR(VLOOKUP($B120,INPUTS!$BB:$BS,12,0),\"N/A\")","v":3},{"$f":"IFERROR(INDEX($E$487:$Z$507,21,MATCH($B120,$E$487:$Z$487,0)),\"N/A\")","v":2.304147465437788E-3},{"$f":"IFERROR(VLOOKUP($B120,INPUTS!$AL:$AY,7,0),\"N/A\")","v":1},{"$f":"IFERROR(VLOOKUP($B120,INPUTS!$AL:$AY,12,0),\"N/A\")","v":1},{"$f":"IFERROR(VLOOKUP($B120,INPUTS!$AL:$AY,8,0),\"N/A\")","v":1},{"$f":"IFERROR(VLOOKUP($B120,INPUTS!$AL:$AY,9,0),\"N/A\")","v":0},{"$f":"'Settings & Instructions'!$C$15","v":0},{"$f":"IFERROR((F120*'Settings & Instructions'!$C$13),0)+IFERROR((H120*'Settings & Instructions'!$C$18),0)+IFERROR((I120*'Settings & Instructions'!$C$19),0)+IFERROR((M120*'Settings & Instructions'!$C$17),0)+IFERROR((N120*'Settings & Instructions'!$C$12),0)+IFERROR((O120*F120),0)","v":156},{"$f":"IFERROR(VLOOKUP($B120,INPUTS!$AL:$AP,5,0),IFERROR(VLOOKUP($B120,INPUTS!$BB:$BF,5,0),\"N/A\"))","v":12}]
[]
[]
[null,"Running Backs",null,"Note: White Cells will populate automatically",null,null,null,null,"STEP 2: Project the individual player stats in the light blue cells"]
[null,"(Click the + on the left to expand)",null,null,null,null,null,null,"Ensure 100% of target share and rush share - see above checks",null,null,null,null,null,null,null,null,null,null,"Range of Outcomes"]
[null,null,null,null,null,null,null,null,null,null,null,null,null,null,null,null,null,null,null,"Low",null,"High"]
[null,"Player","Target Share %","Targets","Catch %","Receptions","Yards per Reception","Receiving Yards","Receiving TDs","Rush Att Share %","Rush Att","Yards per Carry","Rushing Yards","Rushing TDs","Premium","Fantasy Points","Positional Rank","Tier \n(Volume Based)",null,"Fantasy Points","Tier","Fantasy Points","Tier"]
[null,"James Conner",0.08,{"$f":"C127*$F$29","v":50.591999999999999},0.75,{"$f":"D127*E127","v":37.944000000000003},6.5,{"$f":"G127*F127","v":246.63600000000002},1,0.45,{"$f":"J127*$G$29","v":189.72000000000003},4,{"$f":"L127*K127","v":758.88000000000011},6,{"$f":"'Settings & Instructions'!$C$16","v":0},{"$f":"(F127*'Settings & Instructions'!$C$13)+(H127*'Settings & Instructions'!$C$18)+(I127*'Settings & Instructions'!$C$19)+(M127*'Settings & Instructions'!$C$17)+(N127*'Settings & Instructions'!$C$12)+(O127*F127)","v":180.49560000000002},{"$f":"IFERROR(\"RB\"&INDEX('Positional Ranks'!$G:$H,MATCH($B127,'Positional Ranks'!$H:$H,0),1),\"\")","v":"RB1"},{"$f":"IF(K127>(INPUTS!$CS$5-1),\"Elite RB\",IF(AND(K127>(INPUTS!$CS$6-1),D127>(INPUTS!$CT$6-1)),\"Elite RB\",IF(AND(K127>(INPUTS!$CS$7-1),D127>(INPUTS!$CT$7-1)),\"Elite RB\",IF(AND(K127>(INPUTS!$CS$8-1),D127>(INPUTS!$CT$8-1)),\"2nd Tier RB1\",IF(K127>(INPUTS!$CS$9-1),\"Consistent RB2\",IF(D127>(INPUTS!$CT$10-1),\"Consistent RB2\",\"Not a top RB\"))))))","v":"Consistent RB2"},{"$f":"RANK(P127,($P$97:$P$98,$P$108:$P$115,$P$127:$P$130,$P$142:$P$145),0)","v":2}]
[null,"Corey Clement",0.03,18.971999999999998,0.7,{"$f":"D128*E128","v":13.280399999999998},6,79.682399999999987,0,0.15,63.240000000000009,4,{"$f":"L128*K128","v":252.96000000000004},2,{"$f":"'Settings & Instructions'!$C$16","v":0},{"$f":"(F128*'Settings & Instructions'!$C$13)+(H128*'Settings & Instructions'!$C$18)+(I128*'Settings & Instructions'!$C$19)+(M128*'Settings & Instructions'!$C$17)+(N128*'Settings & Instructions'!$C$12)+(O128*F128)","v":58.544640000000001},{"$f":"IFERROR(\"RB\"&INDEX('Positional Ranks'!$G:$H,MATCH($B128,'Positional Ranks'!$H:$H,0),1),\"\")","v":"RB3"},{"$f":"IF(K128>(INPUTS!$CS$5-1),\"Elite RB\",IF(AND(K128>(INPUTS!$CS$6-1),D128>(INPUTS!$CT$6-1)),\"Elite RB\",IF(AND(K128>(INPUTS!$CS$7-1),D128>(INPUTS!$CT$7-1)),\"Elite RB\",IF(AND(K128>(INPUTS!$CS$8-1),D128>(INPUTS!$CT$8-1)),\"2nd Tier RB1\",IF(K128>(INPUTS!$CS$9-1),\"Consistent RB2\",IF(D128>(INPUTS!$CT$10-1),\"Consistent RB2\",\"Not a top RB\"))))))","v":"Not a top RB"},{"$f":"RANK(P128,($P$97:$P$98,$P$108:$P$115,$P$127:$P$130,$P$142:$P$145),0)","v":9}]
[null,"Keaontay Ingram",0.03,18.971999999999998,0.75,14.228999999999999,6.5,92.488499999999988,0,0.15,63.240000000000009,4,252.96000000000004,2,{"$f":"'Settings & Instructions'!$C$16","v":0},{"$f":"(F129*'Settings & Instructions'!$C$13)+(H129*'Settings & Instructions'!$C$18)+(I129*'Settings & Instructions'!$C$19)+(M129*'Settings & Instructions'!$C$17)+(N129*'Settings & Instructions'!$C$12)+(O129*F129)","v":60.773850000000003},{"$f":"IFERROR(\"RB\"&INDEX('Positional Ranks'!$G:$H,MATCH($B129,'Positional Ranks'!$H:$H,0),1),\"\")","v":"RB2"},{"$f":"IF(K129>(INPUTS!$CS$5-1),\"Elite RB\",IF(AND(K129>(INPUTS!$CS$6-1),D129>(INPUTS!$CT$6-1)),\"Elite RB\",IF(AND(K129>(INPUTS!$CS$7-1),D129>(INPUTS!$CT$7-1)),\"Elite RB\",IF(AND(K129>(INPUTS!$CS$8-1),D129>(INPUTS!$CT$8-1)),\"2nd Tier RB1\",IF(K129>(INPUTS!$CS$9-1),\"Consistent RB2\",IF(D129>(INPUTS!$CT$10-1),\"Consistent RB2\",\"Not a top RB\"))))))","v":"Not a top RB"},{"$f":"RANK(P129,($P$97:$P$98,$P$108:$P$115,$P$127:$P$130,$P$142:$P$145),0)","v":8}]
[null,null,null,0,null,0,null,0,null,null,0,null,0,null,{"$f":"'Settings & Instructions'!$C$16","v":0},{"$f":"(F130*'Settings & Instructions'!$C$13)+(H130*'Settings & Instructions'!$C$18)+(I130*'Settings & Instructions'!$C$19)+(M130*'Settings & Instructions'!$C$17)+(N130*'Settings & Instructions'!$C$12)+(O130*F130)","v":0},{"$f":"IFERROR(\"RB\"&INDEX('Positional Ranks'!$G:$H,MATCH($B130,'Positional Ranks'!$H:$H,0),1),\"\")","v":""},{"$f":"IF(K130>(INPUTS!$CS$5-1),\"Elite RB\",IF(AND(K130>(INPUTS!$CS$6-1),D130>(INPUTS!$CT$6-1)),\"Elite RB\",IF(AND(K130>(INPUTS!$CS$7-1),D130>(INPUTS!$CT$7-1)),\"Elite RB\",IF(AND(K130>(INPUTS!$CS$8-1),D130>(INPUTS!$CT$8-1)),\"2nd Tier RB1\",IF(K130>(INPUTS!$CS$9-1),\"Consistent RB2\",IF(D130>(INPUTS!$CT$10-1),\"Consistent RB2\",\"Not a top RB\"))))))","v":"Not a top RB"},{"$f":"RANK(P130,($P$97:$P$98,$P$108:$P$115,$P$127:$P$130,$P$142:$P$145),0)","v":14}]
[]
[null,"Other",0.02,{"$f":"C132*$F$29","v":12.648},0.75,{"$f":"D132*E132","v":9.4860000000000007},null,{"$f":"G132*F132","v":0},1,0.05,{"$f":"J132*$G$29","v":21.080000000000005},4,{"$f":"L132*K132","v":84.320000000000022},2,{"$f":"'Settings & Instructions'!$C$16","v":0},{"$f":"(F132*'Settings & Instructions'!$C$13)+(H132*'Settings & Instructions'!$C$18)+(I132*'Settings & Instructions'!$C$19)+(M132*'Settings & Instructions'!$C$17)+(N132*'Settings & Instructions'!$C$12)+(O132*F132)","v":35.918000000000006}]
[]
[null,"Last Season Data Check",null,"Use this section to see last season's stats as a guide or comparison",null,null,null,null,null,null,null,null,null,null,null,null,"Games Played"]
[null,"James Conner",{"$f":"IFERROR(INDEX($E$179:$Z$199,21,MATCH($B135,$E$179:$Z$179,0)),\"N/A\")","v":8.7349397590361449E-2},{"$f":"IFERROR(VLOOKUP($B135,INPUTS!$BB:$BS,7,0),\"N/A\")","v":58},{"$f":"IFERROR(VLOOKUP($B135,INPUTS!$BB:$BS,9,0),\"N/A\")","v":0.79300000000000004},{"$f":"IFERROR(VLOOKUP($B135,INPUTS!$BB:$BS,8,0),\"N/A\")","v":46},{"$f":"IFERROR(VLOOKUP($B135,INPUTS!$BB:$BS,11,0),\"N/A\")","v":6.5},{"$f":"IFERROR(VLOOKUP($B135,INPUTS!$BB:$BS,10,0),\"N/A\")","v":300},{"$f":"IFERROR(VLOOKUP($B135,INPUTS!$BB:$BS,12,0),\"N/A\")","v":1},{"$f":"IFERROR(INDEX($E$487:$Z$507,21,MATCH($B135,$E$487:$Z$487,0)),\"N/A\")","v":0.42165898617511521},{"$f":"IFERROR(VLOOKUP($B135,INPUTS!$AL:$AY,7,0),\"N/A\")","v":183},{"$f":"IFERROR(VLOOKUP($B135,INPUTS!$AL:$AY,12,0),\"N/A\")","v":4.3},{"$f":"IFERROR(VLOOKUP($B135,INPUTS!$AL:$AY,8,0),\"N/A\")","v":782},{"$f":"IFERROR(VLOOKUP($B135,INPUTS!$AL:$AY,9,0),\"N/A\")","v":7},{"$f":"'Settings & Instructions'!$C$16","v":0},{"$f":"IFERROR((F135*'Settings & Instructions'!$C$13),0)+IFERROR((H135*'Settings & Instructions'!$C$18),0)+IFERROR((I135*'Settings & Instructions'!$C$19),0)+IFERROR((M135*'Settings & Instructions'!$C$17),0)+IFERROR((N135*'Settings & Instructions'!$C$12),0)+IFERROR((O135*F135),0)","v":202.2},{"$f":"IFERROR(VLOOKUP($B135,INPUTS!$AL:$AP,5,0),IFERROR(VLOOKUP($B135,INPUTS!$BB:$BF,5,0),\"N/A\"))","v":13}]
[]
[]
[null,"Tight Ends",null,"Note: White Cells will populate automatically",null,null,null,null,"STEP 2: Project the individual player stats in the light blue cells"]
[null,"(Click the + on the left to expand)",null,null,null,null,null,null,"Ensure 100% of target share and rush share - see above checks",null,null,null,null,null,null,null,null,null,null,"Range of Outcomes"]
[null,null,null,null,null,null,null,null,null,null,null,null,null,null,null,null,null,null,null,"Low",null,"High"]
[null,"Player","Target Share %","Targets","Catch %","Receptions","Yards per Reception","Receiving Yards","Receiving TDs","Rush Att Share %","Rush Att","Yards per Carry","Rushing Yards","Rushing TDs","Premium","Fantasy Points","Positional Rank","Tier \n(Volume Based)",null,"Fantasy Points","Tier","Fantasy Points","Tier"]
[null,"Zach Ertz",0.12,{"$f":"C142*$F$29","v":75.887999999999991},0.67,{"$f":"D142*E142","v":50.84496},9,{"$f":"G142*F142","v":457.60464000000002},3,null,{"$f":"J142*$G$29","v":0},null,{"$f":"L142*K142","v":0},null,{"$f":"'Settings & Instructions'!$C$14","v":1},{"$f":"(F142*'Settings & Instructions'!$C$13)+(H142*'Settings & Instructions'!$C$18)+(I142*'Settings & Instructions'!$C$19)+(M142*'Settings & Instructions'!$C$17)+(N142*'Settings & Instructions'!$C$12)+(O142*F142)","v":165.45038399999999},{"$f":"IFERROR(\"TE\"&INDEX('Positional Ranks'!$M:$N,MATCH($B142,'Positional Ranks'!$N:$N,0),1),\"\")","v":"TE1"},{"$f":"IF(D142>(INPUTS!$CW$5-1),\"Top TE\",IF(D142>(INPUTS!$CW$6-1),\"2nd Tier TE1\",\"Not a top TE\"))","v":"Not a top TE"},{"$f":"RANK(P142,($P$97:$P$98,$P$108:$P$115,$P$127:$P$130,$P$142:$P$145),0)","v":3}]
[null,"Trey McBride",0.09,56.915999999999997,0.65,{"$f":"D143*E143","v":36.995399999999997},9,332.95859999999999,3,null,0,null,{"$f":"L143*K143","v":0},null,{"$f":"'Settings & Instructions'!$C$14","v":1},{"$f":"(F143*'Settings & Instructions'!$C$13)+(H143*'Settings & Instructions'!$C$18)+(I143*'Settings & Instructions'!$C$19)+(M143*'Settings & Instructions'!$C$17)+(N143*'Settings & Instructions'!$C$12)+(O143*F143)","v":125.28665999999998},{"$f":"IFERROR(\"TE\"&INDEX('Positional Ranks'!$M:$N,MATCH($B143,'Positional Ranks'!$N:$N,0),1),\"\")","v":"TE2"},{"$f":"IF(D143>(INPUTS!$CW$5-1),\"Top TE\",IF(D143>(INPUTS!$CW$6-1),\"2nd Tier TE1\",\"Not a top TE\"))","v":"Not a top TE"},{"$f":"RANK(P143,($P$97:$P$98,$P$108:$P$115,$P$127:$P$130,$P$142:$P$145),0)","v":6}]
[null,null,null,0,null,0,null,0,null,null,0,null,0,null,{"$f":"'Settings & Instructions'!$C$14","v":1},{"$f":"(F144*'Settings & Instructions'!$C$13)+(H144*'Settings & Instructions'!$C$18)+(I144*'Settings & Instructions'!$C$19)+(M144*'Settings & Instructions'!$C$17)+(N144*'Settings & Instructions'!$C$12)+(O144*F144)","v":0},{"$f":"IFERROR(\"TE\"&INDEX('Positional Ranks'!$M:$N,MATCH($B144,'Positional Ranks'!$N:$N,0),1),\"\")","v":""},{"$f":"IF(D144>(INPUTS!$CW$5-1),\"Top TE\",IF(D144>(INPUTS!$CW$6-1),\"2nd Tier TE1\",\"Not a top TE\"))","v":"Not a top TE"},{"$f":"RANK(P144,($P$97:$P$98,$P$108:$P$115,$P$127:$P$130,$P$142:$P$145),0)","v":14}]
[null,null,null,0,null,0,null,0,null,null,0,null,0,null,{"$f":"'Settings & Instructions'!$C$14","v":1},{"$f":"(F145*'Settings & Instructions'!$C$13)+(H145*'Settings & Instructions'!$C$18)+(I145*'Settings & Instructions'!$C$19)+(M145*'Settings & Instructions'!$C$17)+(N145*'Settings & Instructions'!$C$12)+(O145*F145)","v":0},{"$f":"IFERROR(\"TE\"&INDEX('Positional Ranks'!$M:$N,MATCH($B145,'Positional Ranks'!$N:$N,0),1),\"\")","v":""},{"$f":"IF(D145>(INPUTS!$CW$5-1),\"Top TE\",IF(D145>(INPUTS!$CW$6-1),\"2nd Tier TE1\",\"Not a top TE\"))","v":"Not a top TE"},{"$f":"RANK(P145,($P$97:$P$98,$P$108:$P$115,$P$127:$P$130,$P$142:$P$145),0)","v":14}]
[]
[null,"Other",0.02,{"$f":"C147*$F$29","v":12.648},0.68,{"$f":"D147*E147","v":8.6006400000000003},9,{"$f":"G147*F147","v":77.405760000000001},2,null,{"$f":"J147*$G$29","v":0},null,{"$f":"L147*K147","v":0},null,{"$f":"'Settings & Instructions'!$C$14","v":1},{"$f":"(F147*'Settings & Instructions'!$C$13)+(H147*'Settings & Instructions'!$C$18)+(I147*'Settings & Instructions'!$C$19)+(M147*'Settings & Instructions'!$C$17)+(N147*'Settings & Instructions'!$C$12)+(O147*F147)","v":36.941856000000001}]
[]
[null,"Last Season Data Check",null,"Use this section to see last season's stats as a guide or comparison",null,null,null,null,null,null,null,null,null,null,null,null,"Games Played"]
[null,"Zach Ertz",{"$f":"IFERROR(INDEX($E$179:$Z$199,21,MATCH($B150,$E$179:$Z$179,0)),\"N/A\")","v":0.10391566265060241},{"$f":"IFERROR(VLOOKUP($B150,INPUTS!$BB:$BS,7,0),\"N/A\")","v":69},{"$f":"IFERROR(VLOOKUP($B150,INPUTS!$BB:$BS,9,0),\"N/A\")","v":0.68100000000000005},{"$f":"IFERROR(VLOOKUP($B150,INPUTS!$BB:$BS,8,0),\"N/A\")","v":47},{"$f":"IFERROR(VLOOKUP($B150,INPUTS!$BB:$BS,11,0),\"N/A\")","v":8.6},{"$f":"IFERROR(VLOOKUP($B150,INPUTS!$BB:$BS,10,0),\"N/A\")","v":406},{"$f":"IFERROR(VLOOKUP($B150,INPUTS!$BB:$BS,12,0),\"N/A\")","v":4},{"$f":"IFERROR(INDEX($E$487:$Z$507,21,MATCH($B150,$E$487:$Z$487,0)),\"N/A\")","v":"N/A"},{"$f":"IFERROR(VLOOKUP($B150,INPUTS!$AL:$AY,7,0),\"N/A\")","v":"N/A"},{"$f":"IFERROR(VLOOKUP($B150,INPUTS!$AL:$AY,12,0),\"N/A\")","v":"N/A"},{"$f":"IFERROR(VLOOKUP($B150,INPUTS!$AL:$AY,8,0),\"N/A\")","v":"N/A"},{"$f":"IFERROR(VLOOKUP($B150,INPUTS!$AL:$AY,9,0),\"N/A\")","v":"N/A"},{"$f":"'Settings & Instructions'!$C$14","v":1},{"$f":"IFERROR((F150*'Settings & Instructions'!$C$13),0)+IFERROR((H150*'Settings & Instructions'!$C$18),0)+IFERROR((I150*'Settings & Instructions'!$C$19),0)+IFERROR((M150*'Settings & Instructions'!$C$17),0)+IFERROR((N150*'Settings & Instructions'!$C$12),0)+IFERROR((O150*F150),0)","v":158.6},{"$f":"IFERROR(VLOOKUP($B150,INPUTS!$AL:$AP,5,0),IFERROR(VLOOKUP($B150,INPUTS!$BB:$BF,5,0),\"N/A\"))","v":10}]
[]
[]
[null,"2022 Data For Reference"]
[]
[null,"Receiving","(Click the + on the left to expand)"]
[]
[null,"Targets","Opponent","QB","Marquise Brown","DeAndre Hopkins","Zach Ertz","Greg Dortch","James Conner","Rondale Moore","A.J. Green","Chosen Anderson","Trey McBride","Eno Benjamin","Andre Baccellia","Darrel Williams","Corey Clement","Stephen Anderson","Keaontay Ingram","Andy Isabella","Maxx Williams","Jonathan Ward","Pharoh Cooper","Ty'Son Williams","Kamu Grugier-Hill",""]
[null,"Week 1","Kansas City Chiefs","Kyler Murray",6,0,4,9,6,0,4,0,0,4,0,0,0,0,0,3,0,0,0,0,0,0]
[null,"Week 2","@ Las Vegas Raiders","Kyler Murray",11,0,11,4,4,0,7,0,0,4,2,3,0,1,0,0,0,0,0,0,0,0]
[null,"Week 3","Los Angeles Rams","Kyler Murray",17,0,10,10,5,0,2,0,0,4,4,1,0,0,0,2,0,0,0,0,0,0]
[null,"Week 4","@ Carolina Panthers","Kyler Murray",11,0,6,1,3,5,0,0,3,1,0,1,0,0,0,0,0,0,0,0,0,0]
[null,"Week 5","Philadelphia Eagles","Kyler Murray",10,0,10,0,1,8,5,0,0,4,0,0,0,0,0,0,0,0,0,0,0,0]
[null,"Week 6","@ Seattle Seahawks","Kyler Murray",9,0,10,0,0,10,4,0,0,3,0,0,0,0,0,0,0,0,0,0,0,0]
[null,"Week 7","New Orleans Saints","Kyler Murray",0,14,4,1,0,2,0,1,0,5,0,0,0,0,2,0,0,0,0,0,0,0]
[null,"Week 8","@ Minnesota Vikings","Kyler Murray",0,13,5,3,0,8,1,3,0,7,0,3,0,0,0,0,0,0,0,0,0,0]
[null,"Week 9","Seattle Seahawks","Kyler Murray",0,5,8,1,5,10,0,3,0,1,0,0,0,0,0,0,0,0,0,0,0,0]
[null,"Week 10","@ Los Angeles Rams","Colt McCoy",0,14,1,0,3,13,2,0,1,0,0,0,0,1,0,0,0,0,0,0,0,0]
[null,"Week 11","San Francisco 49ers","Colt McCoy",0,12,0,10,5,0,9,0,4,0,0,0,0,1,0,0,1,0,0,0,0,0]
[null,"Week 12","Los Angeles Chargers","Kyler Murray",8,6,0,0,3,0,2,3,3,0,1,0,1,0,0,0,0,0,0,0,0,0]
[null,"Week 13","BYE",""]
[null,"Week 14","New England Patriots","Colt McCoy",8,11,0,0,7,0,2,4,6,0,0,0,1,2,0,0,0,0,0,0,0,0]
[null,"Week 15","@ Denver Broncos","Colt McCoy",8,11,0,0,5,0,2,2,5,0,0,0,0,0,0,0,2,0,0,0,0,0]
[null,"Week 16","Tampa Bay Buccaneers","Trace McSorley",6,10,0,11,8,0,0,0,4,0,0,0,0,2,0,0,0,0,0,0,1,0]
[null,"Week 17","@ Atlanta Falcons","David Blough",9,0,0,10,3,0,2,1,10,0,2,0,1,0,0,0,0,0,0,0,0,0]
[null,"Week 18","@ San Francisco 49ers","David Blough",4,0,0,4,0,0,5,0,3,0,1,0,4,0,3,0,0,0,2,1,0,0]
[]
[null,"Total",null,null,107,96,69,64,58,56,47,17,39,33,10,8,7,7,5,5,3,0,2,1,1,0]
[]
[null,"Target Share (%)","Opponent","QB","Marquise Brown","DeAndre Hopkins","Zach Ertz","Greg Dortch","James Conner","Rondale Moore","A.J. Green","Chosen Anderson","Trey McBride","Eno Benjamin","Andre Baccellia","Darrel Williams","Corey Clement","Stephen Anderson","Keaontay Ingram","Andy Isabella","Maxx Williams","Jonathan Ward","Pharoh Cooper","Ty'Son Williams","Kamu Grugier-Hill",""]
[null,"Week 1","Kansas City Chiefs","Kyler Murray",0.15789473684210525,0,0.10526315789473684,0.23684210526315788,0.15789473684210525,0,0.10526315789473684,0,0,0.10526315789473684,0,0,0,0,0,7.8947368421052627E-2,0,0,0,0,0,0]
[null,"Week 2","@ Las Vegas Raiders","Kyler Murray",0.22448979591836735,0,0.22448979591836735,8.1632653061224483E-2,8.1632653061224483E-2,0,0.14285714285714285,0,0,8.1632653061224483E-2,4.0816326530612242E-2,6.1224489795918366E-2,0,2.0408163265306121E-2,0,0,0,0,0,0,0,0]
[null,"Week 3","Los Angeles Rams","Kyler Murray",0.29310344827586204,0,0.17241379310344829,0.17241379310344829,8.6206896551724144E-2,0,3.4482758620689655E-2,0,0,6.8965517241379309E-2,6.8965517241379309E-2,1.7241379310344827E-2,0,0,0,3.4482758620689655E-2,0,0,0,0,0,0]
[null,"Week 4","@ Carolina Panthers","Kyler Murray",0.34375,0,0.1875,3.125E-2,9.375E-2,0.15625,0,0,9.375E-2,3.125E-2,0,3.125E-2,0,0,0,0,0,0,0,0,0,0]
[null,"Week 5","Philadelphia Eagles","Kyler Murray",0.23809523809523808,0,0.23809523809523808,0,2.3809523809523808E-2,0.19047619047619047,0.11904761904761904,0,0,9.5238095238095233E-2,0,0,0,0,0,0,0,0,0,0,0,0]
[null,"Week 6","@ Seattle Seahawks","Kyler Murray",0.24324324324324326,0,0.27027027027027029,0,0,0.27027027027027029,0.10810810810810811,0,0,8.1081081081081086E-2,0,0,0,0,0,0,0,0,0,0,0,0]
[null,"Week 7","New Orleans Saints","Kyler Murray",0,0.48275862068965519,0.13793103448275862,3.4482758620689655E-2,0,6.8965517241379309E-2,0,3.4482758620689655E-2,0,0.17241379310344829,0,0,0,0,6.8965517241379309E-2,0,0,0,0,0,0,0]
[null,"Week 8","@ Minnesota Vikings","Kyler Murray",0,0.29545454545454547,0.11363636363636363,6.8181818181818177E-2,0,0.18181818181818182,2.2727272727272728E-2,6.8181818181818177E-2,0,0.15909090909090909,0,6.8181818181818177E-2,0,0,0,0,0,0,0,0,0,0]
[null,"Week 9","Seattle Seahawks","Kyler Murray",0,0.14285714285714285,0.22857142857142856,2.8571428571428571E-2,0.14285714285714285,0.2857142857142857,0,8.5714285714285715E-2,0,2.8571428571428571E-2,0,0,0,0,0,0,0,0,0,0,0,0]
[null,"Week 10","@ Los Angeles Rams","Colt McCoy",0,0.3783783783783784,2.7027027027027029E-2,0,8.1081081081081086E-2,0.35135135135135137,5.4054054054054057E-2,0,2.7027027027027029E-2,0,0,0,0,2.7027027027027029E-2,0,0,0,0,0,0,0,0]
[null,"Week 11","San Francisco 49ers","Colt McCoy",0,0.27272727272727271,0,0.22727272727272727,0.11363636363636363,0,0.20454545454545456,0,9.0909090909090912E-2,0,0,0,0,2.2727272727272728E-2,0,0,2.2727272727272728E-2,0,0,0,0,0]
[null,"Week 12","Los Angeles Chargers","Kyler Murray",0.27586206896551724,0.20689655172413793,0,0,0.10344827586206896,0,6.8965517241379309E-2,0.10344827586206896,0.10344827586206896,0,3.4482758620689655E-2,0,3.4482758620689655E-2,0,0,0,0,0,0,0,0,0]
[null,"Week 13","BYE",""]
[null,"Week 14","New England Patriots","Colt McCoy",0.1951219512195122,0.26829268292682928,0,0,0.17073170731707318,0,4.878048780487805E-2,9.7560975609756101E-2,0.14634146341463414,0,0,0,2.4390243902439025E-2,4.878048780487805E-2,0,0,0,0,0,0,0,0]
[null,"Week 15","@ Denver Broncos","Colt McCoy",0.22222222222222221,0.30555555555555558,0,0,0.1388888888888889,0,5.5555555555555552E-2,5.5555555555555552E-2,0.1388888888888889,0,0,0,0,0,0,0,5.5555555555555552E-2,0,0,0,0,0]
[null,"Week 16","Tampa Bay Buccaneers","Trace McSorley",0.13043478260869565,0.21739130434782608,0,0.2391304347826087,0.17391304347826086,0,0,0,8.6956521739130432E-2,0,0,0,0,4.3478260869565216E-2,0,0,0,0,0,0,2.1739130434782608E-2,0]
[null,"Week 17","@ Atlanta Falcons","David Blough",0.22500000000000001,0,0,0.25,7.4999999999999997E-2,0,0.05,2.5000000000000001E-2,0.25,0,0.05,0,2.5000000000000001E-2,0,0,0,0,0,0,0,0,0]
[null,"Week 18","@ San Francisco 49ers","David Blough",0.14814814814814814,0,0,0.14814814814814814,0,0,0.18518518518518517,0,0.1111111111111111,0,3.7037037037037035E-2,0,0.14814814814814814,0,0.1111111111111111,0,0,0,7.407407407407407E-2,3.7037037037037035E-2,0,0]
[]
[null,"Total",null,null,0.16114457831325302,0.14457831325301204,0.10391566265060241,9.6385542168674704E-2,8.7349397590361449E-2,8.4337349397590355E-2,7.0783132530120488E-2,2.5602409638554216E-2,5.8734939759036146E-2,4.9698795180722892E-2,1.5060240963855422E-2,1.2048192771084338E-2,1.0542168674698794E-2,1.0542168674698794E-2,7.5301204819277108E-3,7.5301204819277108E-3,4.5180722891566263E-3,0,3.0120481927710845E-3,1.5060240963855422E-3,1.5060240963855422E-3,0]
[]
[null,"aDOT (Cumulative)","Opponent","QB","Marquise Brown","DeAndre Hopkins","Zach Ertz","Greg Dortch","James Conner","Rondale Moore","A.J. Green","Chosen Anderson","Trey McBride","Eno Benjamin","Andre Baccellia","Darrel Williams","Corey Clement","Stephen Anderson","Keaontay Ingram","Andy Isabella","Maxx Williams","Jonathan Ward","Pharoh Cooper","Ty'Son Williams","Kamu Grugier-Hill",""]
[null,"Week 1","Kansas City Chiefs","Kyler Murray",16.8,0,5.5,6.9,1.2,0,10.5,8.8000000000000007,0,0.5,0,0,0,0,0,10,0,0,0,0,0,0]
[null,"Week 2","@ Las Vegas Raiders","Kyler Murray",11.5,0,5.3,6.4,2.6,0,8.3000000000000007,8.3000000000000007,0,-1,3.5,-0.3,0,2,0,10,0,0,0,0,0,0]
[null,"Week 3","Los Angeles Rams","Kyler Murray",9.9,0,5.6,5.3,1.7,0,8.8000000000000007,10.4,0,-1.8,9.1999999999999993,-1,0,2,0,14,0,0,0,0,0,0]
[null,"Week 4","@ Carolina Panthers","Kyler Murray",9.3000000000000007,0,5.6,5.3,1.1000000000000001,11.6,8.8000000000000007,10.9,4,-1.6,9.1999999999999993,-2.8,0,2,0,14,0,0,0,0,0,0]
[null,"Week 5","Philadelphia Eagles","Kyler Murray",9.4,0,6.7,5.3,1.1000000000000001,5.8,10.8,11.9,4,-1.3,9.1999999999999993,-2.8,0,2,0,14,0,0,0,0,0,0]
[null,"Week 6","@ Seattle Seahawks","Kyler Murray",10.5,0,7.6,5.3,1.1000000000000001,5.2,10.5,11.9,4,-1.5,9.1999999999999993,-2.8,0,2,0,14,0,0,0,0,0,0]
[null,"Week 7","New Orleans Saints","Kyler Murray",10.5,9.4,7.6,5.2,1.1000000000000001,5.8,10.5,13,4,-1.6,9.1999999999999993,-2.8,0,2,-2,14,0,0,0,0,0,0]
[null,"Week 8","@ Minnesota Vikings","Kyler Murray",10.5,10.9,7.4,4.8,1.1000000000000001,4.7,11.1,14.1,4,-1.4,9.1999999999999993,-3,0,2,-2,14,0,0,0,0,0,0]
[null,"Week 9","Seattle Seahawks","Kyler Murray",10.5,10.1,7.9,4.5999999999999996,0.4,4.5999999999999996,11.1,13.6,4,-1.2,9.1999999999999993,-3,0,2,-2,14,0,0,0,0,0,0]
[null,"Week 10","@ Los Angeles Rams","Colt McCoy",10.5,9.1,7.9,4.5999999999999996,0.1,5.5,10.6,13.6,4.3,-1.2,9.1999999999999993,-3,0,1,-2,14,0,0,0,0,0,0]
[null,"Week 11","San Francisco 49ers","Colt McCoy",10.5,9.1999999999999993,7.9,3.9,-0.3,5.5,10.4,13.6,2.6,-1.2,9.1999999999999993,-3,0,8,-2,14,3,0,0,0,0,0]
[null,"Week 12","Los Angeles Chargers","Kyler Murray",10.5,10,7.9,4,-0.6,5.5,10.8,13.7,2.8,-1.2,8.6,-3,0,8,-2,14,3,0,0,0,0,0]
[null,"Week 13","BYE","",10.5,10,7.9,4,-0.6,5.5,10.8,13.7,2.8,-1.2,8.6,-3,0,8,-2,14,3,0,0,0,0,0]
[null,"Week 14","New England Patriots","Colt McCoy",10.5,10.199999999999999,7.9,4,-0.6,5.5,10.7,13.1,4.8,-1.2,8.6,-3,2,5,-2,14,3,0,0,0,0,0]
[null,"Week 15","@ Denver Broncos","Colt McCoy",10.3,9.6999999999999993,7.9,4,-0.7,5.5,10.5,14.2,5,-1.2,8.6,-3,2,5,-2,14,4,0,0,0,0,0]
[null,"Week 16","Tampa Bay Buccaneers","Trace McSorley",10.5,10.199999999999999,7.9,4.3,-0.9,5.5,10.5,14.2,4.9000000000000004,-1.2,8.6,-3,2,5.0999999999999996,-2,14,4,0,0,0,0,0]
[null,"Week 17","@ Atlanta Falcons","David Blough",10.8,10.199999999999999,7.9,5.2,-0.8,5.5,10.3,14.1,6.2,-1.2,9.4,-3,2.2999999999999998,5.0999999999999996,-2,14,4,3,0,0,0,0]
[null,"Week 18","@ San Francisco 49ers","David Blough",11.3,10.199999999999999,7.9,4.9000000000000004,-0.8,5.5,11,14.1,6.1,-1.2,9.1,-3,-0.6,5.0999999999999996,-2.2000000000000002,14,4,1.3,-3,-1,0,0]
[]
[]
[null,"aDOT by week","Opponent","QB","Marquise Brown","DeAndre Hopkins","Zach Ertz","Greg Dortch","James Conner","Rondale Moore","A.J. Green","Chosen Anderson","Trey McBride","Eno Benjamin","Andre Baccellia","Darrel Williams","Corey Clement","Stephen Anderson","Keaontay Ingram","Andy Isabella","Maxx Williams","Jonathan Ward","Pharoh Cooper","Ty'Son Williams","Kamu Grugier-Hill",""]
[null,"Week 1","Kansas City Chiefs","Kyler Murray",16.8,0,5.5,6.9,1.2,0,10.5,0,0,0.5,0,0,0,0,0,10,0,0,0,0,0,0]
[null,"Week 2","@ Las Vegas Raiders","Kyler Murray",8.6090909090909076,0,5.2272727272727275,5.2750000000000004,4.7,0,7.0428571428571445,0,0,-2.5,3.5,-0.3,0,2,0,0,0,0,0,0,0,0]
[null,"Week 3","Los Angeles Rams","Kyler Murray",8.3000000000000007,0,6.05,3.8699999999999983,-0.1,0,11.549999999999997,0,0,-3.4000000000000004,12.049999999999999,-3.1,0,0,0,20,0,0,0,0,0,0]
[null,"Week 4","@ Carolina Panthers","Kyler Murray",7.4454545454545489,0,5.5999999999999988,5.3000000000000043,-1.8999999999999997,11.6,0,0,4,0.80000000000000071,0,-10,0,0,0,0,0,0,0,0,0,0]
[null,"Week 5","Philadelphia Eagles","Kyler Murray",9.8499999999999943,0,10.11,0,1.1000000000000014,2.1749999999999989,16,0,0,-0.32500000000000018,0,0,0,0,0,0,0,0,0,0,0,0]
[null,"Week 6","@ Seattle Seahawks","Kyler Murray",17.222222222222214,0,11.290000000000001,0,0,4.4200000000000017,9.1499999999999986,0,0,-2.6333333333333329,0,0,0,0,0,0,0,0,0,0,0,0]
[null,"Week 7","New Orleans Saints","Kyler Murray",0,9.4,7.6000000000000085,2.8000000000000043,0,12.699999999999996,0,13,0,-2,0,0,0,0,-2,0,0,0,0,0,0,0]
[null,"Week 8","@ Minnesota Vikings","Kyler Murray",0,12.515384615384617,5.1999999999999886,1.4666666666666661,0,1.2624999999999975,24.299999999999983,14.466666666666667,0,-0.68571428571428528,0,-3.3333333333333335,0,0,0,0,0,0,0,0,0,0]
[null,"Week 9","Seattle Seahawks","Kyler Murray",0,5.7799999999999958,11.650000000000009,-1.0000000000000426,-2.2600000000000002,4.2700000000000005,0,12.933333333333335,0,5.1999999999999957,0,0,0,0,0,0,0,0,0,0,0,0]
[null,"Week 10","@ Los Angeles Rams","Colt McCoy",0,6.8142857142857123,7.9000000000000341,0,-2.3000000000000007,8.4769230769230806,4.8500000000000085,0,5.1999999999999993,0,0,0,0,0,0,0,0,0,0,0,0,0]
[null,"Week 11","San Francisco 49ers","Colt McCoy",0,9.5833333333333286,0,1.870000000000001,-2.46,0,9.8444444444444432,0,0.90000000000000036,0,0,0,0,22,0,0,3,0,0,0,0,0]
[null,"Week 12","Los Angeles Chargers","Kyler Murray",10.5,17.733333333333338,0,0,-3.8000000000000003,0,17.600000000000023,13.93333333333333,3.3333333333333321,0,5,0,0,0,0,0,0,0,0,0,0,0]
[null,"Week 13","BYE",""]
[null,"Week 14","New England Patriots","Colt McCoy",10.5,11.363636363636356,0,0,-0.59999999999999987,0,8.8999999999999631,11.600000000000003,8.4666666666666668,0,0,0,4,0.5,0,0,0,0,0,0,0,0]
[null,"Week 15","@ Denver Broncos","Colt McCoy",8.3000000000000114,6.2909090909090954,0,0,-1.5399999999999991,0,6.6999999999999744,21.899999999999995,5.6800000000000015,0,0,0,0,0,0,0,4.5,0,0,0,0,0]
[null,"Week 16","Tampa Bay Buccaneers","Trace McSorley",13.433333333333318,14.499999999999991,0,5.363636363636366,-2.0750000000000011,0,0,0,4.3500000000000005,0,0,0,0,5.3499999999999979,0,0,0,0,0,0,0,0]
[null,"Week 17","@ Atlanta Falcons","David Blough",13.933333333333337,0,0,9.6999999999999975,1.0333333333333325,0,6.2999999999999972,12.500000000000007,9.58,0,12.200000000000006,0,2.8999999999999995,0,0,0,0,0,0,0,0,0]
[null,"Week 18","@ San Francisco 49ers","David Blough",24.174999999999997,0,0,0.40000000000000924,0,0,16.879999999999988,0,4.8999999999999853,0,6.3999999999999986,0,-2.7749999999999999,0,-2.3333333333333335,0,0,0,-3,-1,0,0]
[]
[]
[null,"Air Yards","Opponent","QB","Marquise Brown","DeAndre Hopkins","Zach Ertz","Greg Dortch","James Conner","Rondale Moore","A.J. Green","Chosen Anderson","Trey McBride","Eno Benjamin","Andre Baccellia","Darrel Williams","Corey Clement","Stephen Anderson","Keaontay Ingram","Andy Isabella","Maxx Williams","Jonathan Ward","Pharoh Cooper","Ty'Son Williams","Kamu Grugier-Hill",""]
[null,"Week 1","Kansas City Chiefs","Kyler Murray",100.80000000000001,0,22,62.1,7.1999999999999993,0,42,0,0,2,0,0,0,0,0,30,0,0,0,0,0,0]
[null,"Week 2","@ Las Vegas Raiders","Kyler Murray",94.699999999999989,0,57.5,21.1,18.8,0,49.300000000000011,0,0,-10,7,-0.89999999999999991,0,2,0,0,0,0,0,0,0,0]
[null,"Week 3","Los Angeles Rams","Kyler Murray",141.10000000000002,0,60.5,38.699999999999982,-0.5,0,23.099999999999994,0,0,-13.600000000000001,48.199999999999996,-3.1,0,0,0,40,0,0,0,0,0,0]
[null,"Week 4","@ Carolina Panthers","Kyler Murray",81.900000000000034,0,33.599999999999994,5.3000000000000043,-5.6999999999999993,58,0,0,12,0.80000000000000071,0,-10,0,0,0,0,0,0,0,0,0,0]
[null,"Week 5","Philadelphia Eagles","Kyler Murray",98.499999999999943,0,101.1,0,1.1000000000000014,17.399999999999991,80,0,0,-1.3000000000000007,0,0,0,0,0,0,0,0,0,0,0,0]
[null,"Week 6","@ Seattle Seahawks","Kyler Murray",154.99999999999994,0,112.9,0,0,44.200000000000017,36.599999999999994,0,0,-7.8999999999999986,0,0,0,0,0,0,0,0,0,0,0,0]
[null,"Week 7","New Orleans Saints","Kyler Murray",0,131.6,30.400000000000034,2.8000000000000043,0,25.399999999999991,0,13,0,-10,0,0,0,0,-4,0,0,0,0,0,0,0]
[null,"Week 8","@ Minnesota Vikings","Kyler Murray",0,162.70000000000002,25.999999999999943,4.3999999999999986,0,10.09999999999998,24.299999999999983,43.4,0,-4.7999999999999972,0,-10,0,0,0,0,0,0,0,0,0,0]
[null,"Week 9","Seattle Seahawks","Kyler Murray",0,28.899999999999977,93.200000000000074,-1.0000000000000426,-11.3,42.7,0,38.800000000000004,0,5.1999999999999957,0,0,0,0,0,0,0,0,0,0,0,0]
[null,"Week 10","@ Los Angeles Rams","Colt McCoy",0,95.399999999999977,7.9000000000000341,0,-6.9000000000000021,110.20000000000005,9.7000000000000171,0,5.1999999999999993,0,0,0,0,0,0,0,0,0,0,0,0,0]
[null,"Week 11","San Francisco 49ers","Colt McCoy",0,114.99999999999994,5.6843418860808015E-14,18.70000000000001,-12.299999999999999,0,88.6,0,3.6000000000000014,0,0,0,0,22,0,0,3,0,0,0,0,0]
[null,"Week 12","Los Angeles Chargers","Kyler Murray",84,106.40000000000003,-1.7053025658242404E-13,3.8999999999999986,-11.4,0,35.200000000000045,41.79999999999999,9.9999999999999964,0,5,0,0,0,0,0,0,0,0,0,0,0]
[null,"Week 13","BYE",""]
[null,"Week 14","New England Patriots","Colt McCoy",84,124.99999999999991,5.6843418860808015E-14,0,-4.1999999999999993,0,17.799999999999926,46.400000000000013,50.8,0,0,0,4,1,0,0,0,0,0,0,0,0]
[null,"Week 15","@ Denver Broncos","Colt McCoy",66.400000000000091,69.200000000000045,5.6843418860808015E-14,0,-7.6999999999999957,0,13.399999999999949,43.79999999999999,28.400000000000006,0,0,0,0,0,0,0,9,0,0,0,0,0]
[null,"Week 16","Tampa Bay Buccaneers","Trace McSorley",80.599999999999909,144.99999999999991,5.6843418860808015E-14,59.000000000000021,-16.600000000000009,0,0,1.4210854715202004E-14,17.400000000000002,0,0,0,0,10.699999999999996,0,0,0,0,0,0,0,0]
[null,"Week 17","@ Atlanta Falcons","David Blough",125.40000000000003,2.2737367544323206E-13,5.6843418860808015E-14,96.999999999999972,3.0999999999999979,0,12.599999999999994,12.500000000000007,95.8,0,24.400000000000013,0,2.8999999999999995,0,0,0,0,0,0,0,0,0]
[null,"Week 18","@ San Francisco 49ers","David Blough",96.699999999999989,0,5.6843418860808015E-14,1.6000000000000369,0,0,84.399999999999949,1.4210854715202004E-14,14.699999999999957,0,6.3999999999999986,0,-11.1,0,-7,0,0,0,-6,-1,0,0]
[]
[null,"Total",null,null,1209.1000000000001,979.2,545.09999999999991,313.60000000000002,-46.400000000000006,308,517,239.7,237.89999999999995,-39.6,91,-24,-4.2,35.699999999999996,-11,70,12,0,-6,-1,0,0]
[]
[null,"YAC/R","Opponent","QB","Marquise Brown","DeAndre Hopkins","Zach Ertz","Greg Dortch","James Conner","Rondale Moore","A.J. Green","Chosen Anderson","Trey McBride","Eno Benjamin","Andre Baccellia","Darrel Williams","Corey Clement","Stephen Anderson","Keaontay Ingram","Andy Isabella","Maxx Williams","Jonathan Ward","Pharoh Cooper","Ty'Son Williams","Kamu Grugier-Hill",""]
[null,"Week 1","Kansas City Chiefs","Kyler Murray",0.8,0,2,4.4000000000000004,7.6,0,0,0,0,11.7,0,0,0,0,0,4,0,0,0,0,0,0]
[null,"Week 2","@ Las Vegas Raiders","Kyler Murray",4.166666666666667,0,4.125,8.5,14,0,3,0,0,8.6666666666666661,2.5,1,0,0,0,0,0,0,0,0,0,0]
[null,"Week 3","Los Angeles Rams","Kyler Murray",4.2142857142857144,0,3.5,5.333333333333333,5.333333333333333,0,0,0,0,8.5,2,0,0,0,0,1,0,0,0,0,0,0]
[null,"Week 4","@ Carolina Panthers","Kyler Murray",3,0,1.8333333333333333,0,9,3.3333333333333335,0,0,4,9,0,0,0,0,0,0,0,0,0,0,0,0]
[null,"Week 5","Philadelphia Eagles","Kyler Murray",4.25,0,2.6666666666666665,0,7,7.4285714285714288,1,0,0,10.666666666666666,0,0,0,0,0,0,0,0,0,0,0,0]
[null,"Week 6","@ Seattle Seahawks","Kyler Murray",4,0,1.5714285714285714,0,0,7.833333333333333,0,0,0,12,0,0,0,0,0,0,0,0,0,0,0,0]
[null,"Week 7","New Orleans Saints","Kyler Murray",0,1.6,0,1,0,15,0,0,0,8.75,0,0,0,0,13.5,0,0,0,0,0,0,0]
[null,"Week 8","@ Minnesota Vikings","Kyler Murray",0,1.3333333333333333,6.75,7,0,12.428571428571429,0,0,0,5.5,0,6.5,0,0,0,0,0,0,0,0,0,0]
[null,"Week 9","Seattle Seahawks","Kyler Murray",0,4.75,0.6,0,6.2,4.375,0,0,0,10,0,0,0,0,0,0,0,0,0,0,0,0]
[null,"Week 10","@ Los Angeles Rams","Colt McCoy",0,3,4,0,7.666666666666667,3.8888888888888888,0,0,2,0,0,0,0,0,0,0,0,0,0,0,0,0]
[null,"Week 11","San Francisco 49ers","Colt McCoy",0,1.6666666666666667,0,9.6666666666666661,11,0,1,0,2.5,0,0,0,0,0,0,0,4,0,0,0,0,0]
[null,"Week 12","Los Angeles Chargers","Kyler Murray",3.1666666666666665,7.5,0,0,10,0,-4,2,0,0,2,0,8,0,0,0,0,0,0,0,0,0]
[null,"Week 13","BYE",""]
[null,"Week 14","New England Patriots","Colt McCoy",3.25,3.8571428571428572,0,0,5.333333333333333,0,1,5.25,2,0,0,0,17,3,0,0,0,0,0,0,0,0]
[null,"Week 15","@ Denver Broncos","Colt McCoy",3.75,0.8571428571428571,0,0,12,0,0,0,8,0,0,0,0,0,0,0,1,0,0,0,0,0]
[null,"Week 16","Tampa Bay Buccaneers","Trace McSorley",3,6,0,5.5,7.8571428571428568,0,0,0,0.66666666666666663,0,0,0,0,0,0,0,0,0,0,0,4,0]
[null,"Week 17","@ Atlanta Falcons","David Blough",2.3333333333333335,0,0,0.75,10.333333333333334,0,1,1,3.4285714285714284,0,0,0,0,0,0,0,0,0,0,0,0,0]
[null,"Week 18","@ San Francisco 49ers","David Blough",7,0,0,6.25,0,0,13.333333333333334,0,9.6666666666666661,0,0,0,12,0,2.5,0,0,0,6,6,0,0]
[]
[null,"Total",null,null,3.5,2.6,2.8,5.6,8.1999999999999993,6.9,2.2999999999999998,4.8,4,9.4,1.6,3.8,12.2,2,8,2.5,2,2,6,6,4,0]
[]
[null,"Yards per Reception","Opponent","QB","Marquise Brown","DeAndre Hopkins","Zach Ertz","Greg Dortch","James Conner","Rondale Moore","A.J. Green","Chosen Anderson","Trey McBride","Eno Benjamin","Andre Baccellia","Darrel Williams","Corey Clement","Stephen Anderson","Keaontay Ingram","Andy Isabella","Maxx Williams","Jonathan Ward","Pharoh Cooper","Ty'Son Williams","Kamu Grugier-Hill",""]
[null,"Week 1","Kansas City Chiefs","Kyler Murray",10.75,0,7,9,5.8,0,6.5,0,0,11,0,0,0,0,0,10,0,0,0,0,0,0]
[null,"Week 2","@ Las Vegas Raiders","Kyler Murray",11.333333333333334,0,9.375,13.75,13,0,5.333333333333333,0,0,6.666666666666667,6,1.5,0,2,0,0,0,0,0,0,0,0]
[null,"Week 3","Los Angeles Rams","Kyler Murray",10,0,7.5,8.8888888888888893,6,0,0,0,0,3.5,6.5,0,0,0,0,11,0,0,0,0,0,0]
[null,"Week 4","@ Carolina Panthers","Kyler Murray",14.666666666666666,0,7.833333333333333,6,7.333333333333333,3.6666666666666665,0,0,8,9,0,0,0,0,0,0,0,0,0,0,0,0]
[null,"Week 5","Philadelphia Eagles","Kyler Murray",9.75,0,8,0,8,9.7142857142857135,6.666666666666667,0,0,9.3333333333333339,0,0,0,0,0,0,0,0,0,0,0,0]
[null,"Week 6","@ Seattle Seahawks","Kyler Murray",13.6,0,10,0,0,8.1666666666666661,3.5,0,0,9.3333333333333339,0,0,0,0,0,0,0,0,0,0,0,0]
[null,"Week 7","New Orleans Saints","Kyler Murray",0,10.3,10.5,5,0,31,0,0,0,5.25,0,0,0,0,11.5,0,0,0,0,0,0,0]
[null,"Week 8","@ Minnesota Vikings","Kyler Murray",0,13.25,8.5,6,0,13.142857142857142,0,0,0,5.75,0,3,0,0,0,0,0,0,0,0,0,0]
[null,"Week 9","Seattle Seahawks","Kyler Murray",0,9,8,0,3.8,8.625,0,-4,0,15,0,0,0,0,0,0,0,0,0,0,0,0]
[null,"Week 10","@ Los Angeles Rams","Colt McCoy",0,9.8000000000000007,12,0,5.666666666666667,10.444444444444445,5,0,7,0,0,0,0,0,0,0,0,0,0,0,0,0]
[null,"Week 11","San Francisco 49ers","Colt McCoy",0,10.111111111111111,0,11.444444444444445,6,0,10,0,3.5,0,0,0,0,0,0,0,7,0,0,0,0,0]
[null,"Week 12","Los Angeles Chargers","Kyler Murray",7.666666666666667,21.75,0,0,6.666666666666667,0,5,17,1,0,7,0,8,0,0,0,0,0,0,0,0,0]
[null,"Week 13","BYE",""]
[null,"Week 14","New England Patriots","Colt McCoy",8.5,11.285714285714286,0,0,4.833333333333333,0,7,12.5,9.3333333333333339,0,0,0,21,3.5,0,0,0,0,0,0,0,0]
[null,"Week 15","@ Denver Broncos","Colt McCoy",4.75,8.5714285714285712,0,0,9.3333333333333339,0,0,0,13.75,0,0,0,0,0,0,0,5.5,0,0,0,0,0]
[null,"Week 16","Tampa Bay Buccaneers","Trace McSorley",19,4,0,9.8000000000000007,5.8571428571428568,0,0,0,5.666666666666667,0,0,0,0,0,0,0,0,0,0,0,4,0]
[null,"Week 17","@ Atlanta Falcons","David Blough",10.166666666666666,0,0,3.75,10.333333333333334,0,8.5,13,11.142857142857142,0,7,0,0,0,0,0,0,0,0,0,0,0]
[null,"Week 18","@ San Francisco 49ers","David Blough",7,0,0,7.5,0,0,30.333333333333332,0,13.666666666666666,0,6,0,8.3333333333333339,0,-1,0,0,0,3,5,0,0]
[]
[null,"Total",null,null,10.582089552238806,11.203125,8.6382978723404253,8.9807692307692299,6.5217391304347823,10.097560975609756,9.8333333333333339,14.1,9.137931034482758,7.72,6.4285714285714288,2.25,10.8,3,5.25,10.5,6,3.5,3,5,4,0]
[]
[null,"Catch %","Opponent","QB","Marquise Brown","DeAndre Hopkins","Zach Ertz","Greg Dortch","James Conner","Rondale Moore","A.J. Green","Chosen Anderson","Trey McBride","Eno Benjamin","Andre Baccellia","Darrel Williams","Corey Clement","Stephen Anderson","Keaontay Ingram","Andy Isabella","Maxx Williams","Jonathan Ward","Pharoh Cooper","Ty'Son Williams","Kamu Grugier-Hill",""]
[null,"Week 1","Kansas City Chiefs","Kyler Murray",0.66666666666666663,0,0.5,0.77777777777777779,0.83333333333333337,0,0.5,0,0,0.75,0,0,0,0,0,0.33333333333333331,0,0,0,0,0,0]
[null,"Week 2","@ Las Vegas Raiders","Kyler Murray",0.54545454545454541,0,0.72727272727272729,1,0.5,0,0.42857142857142855,0,0,0.75,1,0.66666666666666663,0,1,0,0,0,0,0,0,0,0]
[null,"Week 3","Los Angeles Rams","Kyler Murray",0.82352941176470584,0,0.6,0.9,0.6,0,0,0,0,0.5,0.5,0,0,0,0,0.5,0,0,0,0,0,0]
[null,"Week 4","@ Carolina Panthers","Kyler Murray",0.54545454545454541,0,1,1,1,0.6,0,0,1,1,0,0,0,0,0,0,0,0,0,0,0,0]
[null,"Week 5","Philadelphia Eagles","Kyler Murray",0.8,0,0.6,0,1,0.875,0.6,0,0,0.75,0,0,0,0,0,0,0,0,0,0,0,0]
[null,"Week 6","@ Seattle Seahawks","Kyler Murray",0.55555555555555558,0,0.7,0,0,0.6,0.5,0,0,1,0,0,0,0,0,0,0,0,0,0,0,0]
[null,"Week 7","New Orleans Saints","Kyler Murray",0,0.7142857142857143,0.5,1,0,0.5,0,0,0,0.8,0,0,0,0,1,0,0,0,0,0,0,0]
[null,"Week 8","@ Minnesota Vikings","Kyler Murray",0,0.92307692307692313,0.8,0.66666666666666663,0,0.875,0,0,0,0.5714285714285714,0,0.66666666666666663,0,0,0,0,0,0,0,0,0,0]
[null,"Week 9","Seattle Seahawks","Kyler Murray",0,0.8,0.625,1,1,0.8,0,0.33333333333333331,0,1,0,0,0,0,0,0,0,0,0,0,0,0]
[null,"Week 10","@ Los Angeles Rams","Colt McCoy",0,0.7142857142857143,1,0,1,0.69230769230769229,1,0,1,0,0,0,0,0,0,0,0,0,0,0,0,0]
[null,"Week 11","San Francisco 49ers","Colt McCoy",0,0.75,0,0.9,0.4,0,0.55555555555555558,0,1,0,0,0,0,0,0,0,1,0,0,0,0,0]
[null,"Week 12","Los Angeles Chargers","Kyler Murray",0.75,0.66666666666666663,0,0,1,0,0.5,0.33333333333333331,0.33333333333333331,0,1,0,1,0,0,0,0,0,0,0,0,0]
[null,"Week 13","BYE",""]
[null,"Week 14","New England Patriots","Colt McCoy",0.5,0.63636363636363635,0,0,0.8571428571428571,0,0.5,1,0.5,0,0,0,1,1,0,0,0,0,0,0,0,0]
[null,"Week 15","@ Denver Broncos","Colt McCoy",0.5,0.63636363636363635,0,0,0.6,0,0,0,0.8,0,0,0,0,0,0,0,1,0,0,0,0,0]
[null,"Week 16","Tampa Bay Buccaneers","Trace McSorley",0.5,0.1,0,0.90909090909090906,0.875,0,0,0,0.75,0,0,0,0,0,0,0,0,0,0,0,1,0]
[null,"Week 17","@ Atlanta Falcons","David Blough",0.66666666666666663,0,0,0.4,1,0,1,1,0.7,0,0.5,0,0,0,0,0,0,0,0,0,0,0]
[null,"Week 18","@ San Francisco 49ers","David Blough",0.25,0,0,1,0,0,0.6,0,1,0,1,0,0.75,0,0.66666666666666663,0,0,0,1,1,0,0]
[]
[null,"Total",null,null,0.62616822429906538,0.66666666666666663,0.6811594202898551,0.8125,0.7931034482758621,0.7321428571428571,0.51063829787234039,0.45454545454545453,0.74358974358974361,0.73529411764705888,0.7,0.5,0.7142857142857143,0.42857142857142855,0.8,0.4,1,0.66666666666666663,1,1,1,0]
[]
[null,"Receiving Yards","Opponent","QB","Marquise Brown","DeAndre Hopkins","Zach Ertz","Greg Dortch","James Conner","Rondale Moore","A.J. Green","Chosen Anderson","Trey McBride","Eno Benjamin","Andre Baccellia","Darrel Williams","Corey Clement","Stephen Anderson","Keaontay Ingram","Andy Isabella","Maxx Williams","Jonathan Ward","Pharoh Cooper","Ty'Son Williams","Kamu Grugier-Hill",""]
[null,"Week 1","Kansas City Chiefs","Kyler Murray",43,0,14,63,29,0,13,0,0,33,0,0,0,0,0,10,0,0,0,0,0,0]
[null,"Week 2","@ Las Vegas Raiders","Kyler Murray",68,0,75,55,26,0,16,0,0,20,12,3,0,2,0,0,0,0,0,0,0,0]
[null,"Week 3","Los Angeles Rams","Kyler Murray",140,0,45,80,18,0,0,0,0,7,13,0,0,0,0,11,0,0,0,0,0,0]
[null,"Week 4","@ Carolina Panthers","Kyler Murray",88,0,47,6,22,11,0,0,24,9,0,0,0,0,0,0,0,0,0,0,0,0]
[null,"Week 5","Philadelphia Eagles","Kyler Murray",78,0,48,0,8,68,20,0,0,28,0,0,0,0,0,0,0,0,0,0,0,0]
[null,"Week 6","@ Seattle Seahawks","Kyler Murray",68,0,70,0,0,49,7,0,0,28,0,0,0,0,0,0,0,0,0,0,0,0]
[null,"Week 7","New Orleans Saints","Kyler Murray",0,103,21,5,0,31,0,0,0,21,0,0,0,0,23,0,0,0,0,0,0,0]
[null,"Week 8","@ Minnesota Vikings","Kyler Murray",0,159,34,12,0,92,0,0,0,23,0,6,0,0,0,0,0,0,0,0,0,0]
[null,"Week 9","Seattle Seahawks","Kyler Murray",0,36,40,0,19,69,0,-4,0,15,0,0,0,0,0,0,0,0,0,0,0,0]
[null,"Week 10","@ Los Angeles Rams","Colt McCoy",0,98,12,0,17,94,10,0,7,0,0,0,0,0,0,0,0,0,0,0,0,0]
[null,"Week 11","San Francisco 49ers","Colt McCoy",0,91,0,103,12,0,50,0,14,0,0,0,0,0,0,0,7,0,0,0,0,0]
[null,"Week 12","Los Angeles Chargers","Kyler Murray",46,87,0,0,20,0,5,17,1,0,7,0,8,0,0,0,0,0,0,0,0,0]
[null,"Week 13","BYE",""]
[null,"Week 14","New England Patriots","Colt McCoy",34,79,0,0,29,0,7,50,28,0,0,0,21,7,0,0,0,0,0,0,0,0]
[null,"Week 15","@ Denver Broncos","Colt McCoy",19,60,0,0,28,0,0,0,55,0,0,0,0,0,0,0,11,0,0,0,0,0]
[null,"Week 16","Tampa Bay Buccaneers","Trace McSorley",57,4,0,98,41,0,0,0,17,0,0,0,0,0,0,0,0,0,0,0,4,0]
[null,"Week 17","@ Atlanta Falcons","David Blough",61,0,0,15,31,0,17,13,78,0,7,0,0,0,0,0,0,0,0,0,0,0]
[null,"Week 18","@ San Francisco 49ers","David Blough",7,0,0,30,0,0,91,0,41,0,6,0,25,0,-2,0,0,0,6,5,0,0]
[]
[null,"Total",null,null,709,717,406,467,300,414,236,76,265,184,45,9,54,9,21,21,18,0,6,5,4,0]
[]
[null,"Receiving yards per team pass attempt","Opponent","QB","Marquise Brown","DeAndre Hopkins","Zach Ertz","Greg Dortch","James Conner","Rondale Moore","A.J. Green","Chosen Anderson","Trey McBride","Eno Benjamin","Andre Baccellia","Darrel Williams","Corey Clement","Stephen Anderson","Keaontay Ingram","Andy Isabella","Maxx Williams","Jonathan Ward","Pharoh Cooper","Ty'Son Williams","Kamu Grugier-Hill",""]
[null,"Week 1","Kansas City Chiefs","Kyler Murray",1.131578947368421,0,0.36842105263157893,1.6578947368421053,0.76315789473684215,0,0.34210526315789475,0,0,0.86842105263157898,0,0,0,0,0,0.26315789473684209,0,0,0,0,0,0]
[null,"Week 2","@ Las Vegas Raiders","Kyler Murray",1.3877551020408163,0,1.5306122448979591,1.1224489795918366,0.53061224489795922,0,0.32653061224489793,0,0,0.40816326530612246,0.24489795918367346,6.1224489795918366E-2,0,4.0816326530612242E-2,0,0,0,0,0,0,0,0]
[null,"Week 3","Los Angeles Rams","Kyler Murray",2.4137931034482758,0,0.77586206896551724,1.3793103448275863,0.31034482758620691,0,0,0,0,0.1206896551724138,0.22413793103448276,0,0,0,0,0.18965517241379309,0,0,0,0,0,0]
[null,"Week 4","@ Carolina Panthers","Kyler Murray",2.75,0,1.46875,0.1875,0.6875,0.34375,0,0,0.75,0.28125,0,0,0,0,0,0,0,0,0,0,0,0]
[null,"Week 5","Philadelphia Eagles","Kyler Murray",1.8571428571428572,0,1.1428571428571428,0,0.19047619047619047,1.6190476190476191,0.47619047619047616,0,0,0.66666666666666663,0,0,0,0,0,0,0,0,0,0,0,0]
[null,"Week 6","@ Seattle Seahawks","Kyler Murray",1.8378378378378379,0,1.8918918918918919,0,0,1.3243243243243243,0.1891891891891892,0,0,0.7567567567567568,0,0,0,0,0,0,0,0,0,0,0,0]
[null,"Week 7","New Orleans Saints","Kyler Murray",0,3.5517241379310347,0.72413793103448276,0.17241379310344829,0,1.0689655172413792,0,0,0,0.72413793103448276,0,0,0,0,0.7931034482758621,0,0,0,0,0,0,0]
[null,"Week 8","@ Minnesota Vikings","Kyler Murray",0,3.6136363636363638,0.77272727272727271,0.27272727272727271,0,2.0909090909090908,0,0,0,0.52272727272727271,0,0.13636363636363635,0,0,0,0,0,0,0,0,0,0]
[null,"Week 9","Seattle Seahawks","Kyler Murray",0,1.0285714285714285,1.1428571428571428,0,0.54285714285714282,1.9714285714285715,0,-0.11428571428571428,0,0.42857142857142855,0,0,0,0,0,0,0,0,0,0,0,0]
[null,"Week 10","@ Los Angeles Rams","Colt McCoy",0,2.6486486486486487,0.32432432432432434,0,0.45945945945945948,2.5405405405405403,0.27027027027027029,0,0.1891891891891892,0,0,0,0,0,0,0,0,0,0,0,0,0]
[null,"Week 11","San Francisco 49ers","Colt McCoy",0,2.0681818181818183,0,2.3409090909090908,0.27272727272727271,0,1.1363636363636365,0,0.31818181818181818,0,0,0,0,0,0,0,0.15909090909090909,0,0,0,0,0]
[null,"Week 12","Los Angeles Chargers","Kyler Murray",1.5862068965517242,3,0,0,0.68965517241379315,0,0.17241379310344829,0.58620689655172409,3.4482758620689655E-2,0,0.2413793103448276,0,0.27586206896551724,0,0,0,0,0,0,0,0,0]
[null,"Week 13","BYE",""]
[null,"Week 14","New England Patriots","Colt McCoy",0.82926829268292679,1.9268292682926829,0,0,0.70731707317073167,0,0.17073170731707318,1.2195121951219512,0.68292682926829273,0,0,0,0.51219512195121952,0.17073170731707318,0,0,0,0,0,0,0,0]
[null,"Week 15","@ Denver Broncos","Colt McCoy",0.52777777777777779,1.6666666666666667,0,0,0.77777777777777779,0,0,0,1.5277777777777777,0,0,0,0,0,0,0,0.30555555555555558,0,0,0,0,0]
[null,"Week 16","Tampa Bay Buccaneers","Trace McSorley",1.2391304347826086,8.6956521739130432E-2,0,2.1304347826086958,0.89130434782608692,0,0,0,0.36956521739130432,0,0,0,0,0,0,0,0,0,0,0,8.6956521739130432E-2,0]
[null,"Week 17","@ Atlanta Falcons","David Blough",1.5249999999999999,0,0,0.375,0.77500000000000002,0,0.42499999999999999,0.32500000000000001,1.95,0,0.17499999999999999,0,0,0,0,0,0,0,0,0,0,0]
[null,"Week 18","@ San Francisco 49ers","David Blough",0.25925925925925924,0,0,1.1111111111111112,0,0,3.3703703703703702,0,1.5185185185185186,0,0.22222222222222221,0,0.92592592592592593,0,-7.407407407407407E-2,0,0,0,0.22222222222222221,0.18518518518518517,0,0]
[]
[null,"Total",null,null,1.0677710843373494,1.0798192771084338,0.61144578313253017,0.70331325301204817,0.45180722891566266,0.62349397590361444,0.35542168674698793,0.1144578313253012,0.3990963855421687,0.27710843373493976,6.7771084337349394E-2,1.355421686746988E-2,8.1325301204819275E-2,1.355421686746988E-2,3.1626506024096383E-2,3.1626506024096383E-2,2.710843373493976E-2,0,9.0361445783132526E-3,7.5301204819277108E-3,6.024096385542169E-3,0]
[]
[null,"RZ Targets (Inside 20)","Opponent","QB","Marquise Brown","DeAndre Hopkins","Zach Ertz","Greg Dortch","James Conner","Rondale Moore","A.J. Green","Chosen Anderson","Trey McBride","Eno Benjamin","Andre Baccellia","Darrel Williams","Corey Clement","Stephen Anderson","Keaontay Ingram","Andy Isabella","Maxx Williams","Jonathan Ward","Pharoh Cooper","Ty'Son Williams","Kamu Grugier-Hill",""]
[null,"Week 1","Kansas City Chiefs","Kyler Murray",2,0,2,0,0,0,0,0,0,0,0,0,0,0,0,0,0,0,0,0,0,0]
[null,"Week 2","@ Las Vegas Raiders","Kyler Murray",2,0,3,1,0,0,2,0,0,0,0,1,0,0,0,0,0,0,0,0,0,0]
[null,"Week 3","Los Angeles Rams","Kyler Murray",0,0,3,1,1,0,0,0,0,2,0,0,0,0,0,0,0,0,0,0,0,0]
[null,"Week 4","@ Carolina Panthers","Kyler Murray",0,0,2,0,0,1,0,0,0,0,0,0,0,0,0,0,0,0,0,0,0,0]
[null,"Week 5","Philadelphia Eagles","Kyler Murray",0,0,1,0,0,1,0,0,0,1,0,0,0,0,0,0,0,0,0,0,0,0]
[null,"Week 6","@ Seattle Seahawks","Kyler Murray",0,0,0,0,0,0,1,0,0,0,0,0,0,0,0,0,0,0,0,0,0,0]
[null,"Week 7","New Orleans Saints","Kyler Murray",0,1,1,1,0,1,0,0,0,1,0,0,0,0,1,0,0,0,0,0,0,0]
[null,"Week 8","@ Minnesota Vikings","Kyler Murray",0,1,2,0,0,1,0,0,0,0,0,0,0,0,0,0,0,0,0,0,0,0]
[null,"Week 9","Seattle Seahawks","Kyler Murray",0,0,1,0,1,1,0,0,0,0,0,0,0,0,0,0,0,0,0,0,0,0]
[null,"Week 10","@ Los Angeles Rams","Colt McCoy",0,2,0,0,1,1,1,0,0,0,0,0,0,0,0,0,0,0,0,0,0,0]
[null,"Week 11","San Francisco 49ers","Colt McCoy",0,1,0,1,0,0,2,0,0,0,0,0,0,0,0,0,0,0,0,0,0,0]
[null,"Week 12","Los Angeles Chargers","Kyler Murray",2,0,0,0,1,0,0,0,0,0,0,0,0,0,0,0,0,0,0,0,0,0]
[null,"Week 13","BYE",""]
[null,"Week 14","New England Patriots","Colt McCoy",3,1,0,0,0,0,0,1,0,0,0,0,0,0,0,0,0,0,0,0,0,0]
[null,"Week 15","@ Denver Broncos","Colt McCoy",0,0,0,0,0,0,0,0,0,0,0,0,0,0,0,0,0,0,0,0,0,0]
[null,"Week 16","Tampa Bay Buccaneers","Trace McSorley",0,0,0,0,0,0,0,0,0,0,0,0,0,0,0,0,0,0,0,0,0,0]
[null,"Week 17","@ Atlanta Falcons","David Blough",1,0,0,1,0,0,0,0,1,0,1,0,0,0,0,0,0,0,0,0,0,0]
[null,"Week 18","@ San Francisco 49ers","David Blough",0,0,0,0,0,0,0,0,0,0,0,0,0,0,0,0,0,0,0,0,0,0]
[]
[null,"Total",null,null,10,6,15,5,4,6,6,1,1,4,1,1,0,0,1,0,0,0,0,0,0,0]
[]
[null,"RZ Target % (Inside 20)","Opponent","QB","Marquise Brown","DeAndre Hopkins","Zach Ertz","Greg Dortch","James Conner","Rondale Moore","A.J. Green","Chosen Anderson","Trey McBride","Eno Benjamin","Andre Baccellia","Darrel Williams","Corey Clement","Stephen Anderson","Keaontay Ingram","Andy Isabella","Maxx Williams","Jonathan Ward","Pharoh Cooper","Ty'Son Williams","Kamu Grugier-Hill",""]
[null,"Week 1","Kansas City Chiefs","Kyler Murray",0.5,0,0.5,0,0,0,0,0,0,0,0,0,0,0,0,0,0,0,0,0,0,0]
[null,"Week 2","@ Las Vegas Raiders","Kyler Murray",0.22222222222222221,0,0.33333333333333331,0.1111111111111111,0,0,0.22222222222222221,0,0,0,0,0.1111111111111111,0,0,0,0,0,0,0,0,0,0]
[null,"Week 3","Los Angeles Rams","Kyler Murray",0,0,0.42857142857142855,0.14285714285714285,0.14285714285714285,0,0,0,0,0.2857142857142857,0,0,0,0,0,0,0,0,0,0,0,0]
[null,"Week 4","@ Carolina Panthers","Kyler Murray",0,0,0.66666666666666663,0,0,0.33333333333333331,0,0,0,0,0,0,0,0,0,0,0,0,0,0,0,0]
[null,"Week 5","Philadelphia Eagles","Kyler Murray",0,0,0.33333333333333331,0,0,0.33333333333333331,0,0,0,0.33333333333333331,0,0,0,0,0,0,0,0,0,0,0,0]
[null,"Week 6","@ Seattle Seahawks","Kyler Murray",0,0,0,0,0,0,1,0,0,0,0,0,0,0,0,0,0,0,0,0,0,0]
[null,"Week 7","New Orleans Saints","Kyler Murray",0,0.16666666666666666,0.16666666666666666,0.16666666666666666,0,0.16666666666666666,0,0,0,0.16666666666666666,0,0,0,0,0.16666666666666666,0,0,0,0,0,0,0]
[null,"Week 8","@ Minnesota Vikings","Kyler Murray",0,0.25,0.5,0,0,0.25,0,0,0,0,0,0,0,0,0,0,0,0,0,0,0,0]
[null,"Week 9","Seattle Seahawks","Kyler Murray",0,0,0.33333333333333331,0,0.33333333333333331,0.33333333333333331,0,0,0,0,0,0,0,0,0,0,0,0,0,0,0,0]
[null,"Week 10","@ Los Angeles Rams","Colt McCoy",0,0.4,0,0,0.2,0.2,0.2,0,0,0,0,0,0,0,0,0,0,0,0,0,0,0]
[null,"Week 11","San Francisco 49ers","Colt McCoy",0,0.25,0,0.25,0,0,0.5,0,0,0,0,0,0,0,0,0,0,0,0,0,0,0]
[null,"Week 12","Los Angeles Chargers","Kyler Murray",0.66666666666666663,0,0,0,0.33333333333333331,0,0,0,0,0,0,0,0,0,0,0,0,0,0,0,0,0]
[null,"Week 13","BYE",""]
[null,"Week 14","New England Patriots","Colt McCoy",0.6,0.2,0,0,0,0,0,0.2,0,0,0,0,0,0,0,0,0,0,0,0,0,0]
[null,"Week 15","@ Denver Broncos","Colt McCoy",0,0,0,0,0,0,0,0,0,0,0,0,0,0,0,0,0,0,0,0,0,0]
[null,"Week 16","Tampa Bay Buccaneers","Trace McSorley",0,0,0,0,0,0,0,0,0,0,0,0,0,0,0,0,0,0,0,0,0,0]
[null,"Week 17","@ Atlanta Falcons","David Blough",0.25,0,0,0.25,0,0,0,0,0.25,0,0.25,0,0,0,0,0,0,0,0,0,0,0]
[null,"Week 18","@ San Francisco 49ers","David Blough",0,0,0,0,0,0,0,0,0,0,0,0,0,0,0,0,0,0,0,0,0,0]
[]
[null,"Total",null,null,0.16393442622950818,9.8360655737704916E-2,0.24590163934426229,8.1967213114754092E-2,6.5573770491803282E-2,9.8360655737704916E-2,9.8360655737704916E-2,1.6393442622950821E-2,1.6393442622950821E-2,6.5573770491803282E-2,1.6393442622950821E-2,1.6393442622950821E-2,0,0,1.6393442622950821E-2,0,0,0,0,0,0,0]
[]
[null,"RZ Targets (Inside 10)","Opponent","QB","Marquise Brown","DeAndre Hopkins","Zach Ertz","Greg Dortch","James Conner","Rondale Moore","A.J. Green","Chosen Anderson","Trey McBride","Eno Benjamin","Andre Baccellia","Darrel Williams","Corey Clement","Stephen Anderson","Keaontay Ingram","Andy Isabella","Maxx Williams","Jonathan Ward","Pharoh Cooper","Ty'Son Williams","Kamu Grugier-Hill",""]
[null,"Week 1","Kansas City Chiefs","Kyler Murray",1,0,2,0,0,0,0,0,0,0,0,0,0,0,0,0,0,0,0,0,0,0]
[null,"Week 2","@ Las Vegas Raiders","Kyler Murray",1,0,2,1,0,0,2,0,0,0,0,1,0,0,0,0,0,0,0,0,0,0]
[null,"Week 3","Los Angeles Rams","Kyler Murray",0,0,1,0,1,0,0,0,0,0,0,0,0,0,0,0,0,0,0,0,0,0]
[null,"Week 4","@ Carolina Panthers","Kyler Murray",0,0,1,0,0,0,0,0,0,0,0,0,0,0,0,0,0,0,0,0,0,0]
[null,"Week 5","Philadelphia Eagles","Kyler Murray",0,0,1,0,0,1,0,0,0,0,0,0,0,0,0,0,0,0,0,0,0,0]
[null,"Week 6","@ Seattle Seahawks","Kyler Murray",0,0,0,0,0,0,1,0,0,0,0,0,0,0,0,0,0,0,0,0,0,0]
[null,"Week 7","New Orleans Saints","Kyler Murray",0,0,1,1,0,1,0,0,0,1,0,0,0,0,0,0,0,0,0,0,0,0]
[null,"Week 8","@ Minnesota Vikings","Kyler Murray",0,1,1,0,0,0,0,0,0,0,0,0,0,0,0,0,0,0,0,0,0,0]
[null,"Week 9","Seattle Seahawks","Kyler Murray",0,0,1,0,0,0,0,0,0,0,0,0,0,0,0,0,0,0,0,0,0,0]
[null,"Week 10","@ Los Angeles Rams","Colt McCoy",0,1,0,0,0,0,1,0,0,0,0,0,0,0,0,0,0,0,0,0,0,0]
[null,"Week 11","San Francisco 49ers","Colt McCoy",0,0,0,1,0,0,0,0,0,0,0,0,0,0,0,0,0,0,0,0,0,0]
[null,"Week 12","Los Angeles Chargers","Kyler Murray",0,0,0,0,1,0,0,0,0,0,0,0,0,0,0,0,0,0,0,0,0,0]
[null,"Week 13","BYE",""]
[null,"Week 14","New England Patriots","Colt McCoy",0,0,0,0,0,0,0,0,0,0,0,0,0,0,0,0,0,0,0,0,0,0]
[null,"Week 15","@ Denver Broncos","Colt McCoy",0,0,0,0,0,0,0,0,0,0,0,0,0,0,0,0,0,0,0,0,0,0]
[null,"Week 16","Tampa Bay Buccaneers","Trace McSorley",0,0,0,0,0,0,0,0,0,0,0,0,0,0,0,0,0,0,0,0,0,0]
[null,"Week 17","@ Atlanta Falcons","David Blough",0,0,0,0,0,0,0,0,1,0,0,0,0,0,0,0,0,0,0,0,0,0]
[null,"Week 18","@ San Francisco 49ers","David Blough",0,0,0,0,0,0,0,0,0,0,0,0,0,0,0,0,0,0,0,0,0,0]
[]
[null,"Total",null,null,2,2,10,3,2,2,4,0,1,1,0,1,0,0,0,0,0,0,0,0,0,0]
[]
[null,"RZ Target % (Inside 10)","Opponent","QB","Marquise Brown","DeAndre Hopkins","Zach Ertz","Greg Dortch","James Conner","Rondale Moore","A.J. Green","Chosen Anderson","Trey McBride","Eno Benjamin","Andre Baccellia","Darrel Williams","Corey Clement","Stephen Anderson","Keaontay Ingram","Andy Isabella","Maxx Williams","Jonathan Ward","Pharoh Cooper","Ty'Son Williams","Kamu Grugier-Hill",""]
[null,"Week 1","Kansas City Chiefs","Kyler Murray",0.33333333333333331,0,0.66666666666666663,0,0,0,0,0,0,0,0,0,0,0,0,0,0,0,0,0,0,0]
[null,"Week 2","@ Las Vegas Raiders","Kyler Murray",0.14285714285714285,0,0.2857142857142857,0.14285714285714285,0,0,0.2857142857142857,0,0,0,0,0.14285714285714285,0,0,0,0,0,0,0,0,0,0]
[null,"Week 3","Los Angeles Rams","Kyler Murray",0,0,0.5,0,0.5,0,0,0,0,0,0,0,0,0,0,0,0,0,0,0,0,0]
[null,"Week 4","@ Carolina Panthers","Kyler Murray",0,0,1,0,0,0,0,0,0,0,0,0,0,0,0,0,0,0,0,0,0,0]
[null,"Week 5","Philadelphia Eagles","Kyler Murray",0,0,0.5,0,0,0.5,0,0,0,0,0,0,0,0,0,0,0,0,0,0,0,0]
[null,"Week 6","@ Seattle Seahawks","Kyler Murray",0,0,0,0,0,0,1,0,0,0,0,0,0,0,0,0,0,0,0,0,0,0]
[null,"Week 7","New Orleans Saints","Kyler Murray",0,0,0.25,0.25,0,0.25,0,0,0,0.25,0,0,0,0,0,0,0,0,0,0,0,0]
[null,"Week 8","@ Minnesota Vikings","Kyler Murray",0,0.5,0.5,0,0,0,0,0,0,0,0,0,0,0,0,0,0,0,0,0,0,0]
[null,"Week 9","Seattle Seahawks","Kyler Murray",0,0,1,0,0,0,0,0,0,0,0,0,0,0,0,0,0,0,0,0,0,0]
[null,"Week 10","@ Los Angeles Rams","Colt McCoy",0,0.5,0,0,0,0,0.5,0,0,0,0,0,0,0,0,0,0,0,0,0,0,0]
[null,"Week 11","San Francisco 49ers","Colt McCoy",0,0,0,1,0,0,0,0,0,0,0,0,0,0,0,0,0,0,0,0,0,0]
[null,"Week 12","Los Angeles Chargers","Kyler Murray",0,0,0,0,1,0,0,0,0,0,0,0,0,0,0,0,0,0,0,0,0,0]
[null,"Week 13","BYE",""]
[null,"Week 14","New England Patriots","Colt McCoy",0,0,0,0,0,0,0,0,0,0,0,0,0,0,0,0,0,0,0,0,0,0]
[null,"Week 15","@ Denver Broncos","Colt McCoy",0,0,0,0,0,0,0,0,0,0,0,0,0,0,0,0,0,0,0,0,0,0]
[null,"Week 16","Tampa Bay Buccaneers","Trace McSorley",0,0,0,0,0,0,0,0,0,0,0,0,0,0,0,0,0,0,0,0,0,0]
[null,"Week 17","@ Atlanta Falcons","David Blough",0,0,0,0,0,0,0,0,1,0,0,0,0,0,0,0,0,0,0,0,0,0]
[null,"Week 18","@ San Francisco 49ers","David Blough",0,0,0,0,0,0,0,0,0,0,0,0,0,0,0,0,0,0,0,0,0,0]
[]
[null,"Total",null,null,7.1428571428571425E-2,7.1428571428571425E-2,0.35714285714285715,0.10714285714285714,7.1428571428571425E-2,7.1428571428571425E-2,0.14285714285714285,0,3.5714285714285712E-2,3.5714285714285712E-2,0,3.5714285714285712E-2,0,0,0,0,0,0,0,0,0,0]
[]
[null,"Rushing","(Click the + on the left to expand)"]
[]
[null,"Rush Att","Opponent","QB","James Conner","Eno Benjamin","Kyler Murray","Keaontay Ingram","Darrel Williams","Corey Clement","Trace McSorley","Colt McCoy","Greg Dortch","Rondale Moore","Jonathan Ward","David Blough","Pharoh Cooper","Marquise Brown","Andy Isabella","","","","","","",""]
[null,"Week 1","Kansas City Chiefs","Kyler Murray",10,4,5,0,0,0,3,0,0,0,0,0,0,0,0,0,0,0,0,0,0,0]
[null,"Week 2","@ Las Vegas Raiders","Kyler Murray",7,8,5,0,8,0,0,0,0,0,0,0,0,0,0,0,0,0,0,0,0,0]
[null,"Week 3","Los Angeles Rams","Kyler Murray",13,5,2,0,1,0,0,0,0,0,0,0,0,0,0,0,0,0,0,0,0,0]
[null,"Week 4","@ Carolina Panthers","Kyler Murray",15,5,12,0,4,0,0,0,0,1,0,0,0,0,0,0,0,0,0,0,0,0]
[null,"Week 5","Philadelphia Eagles","Kyler Murray",9,8,4,0,3,0,0,0,0,2,0,0,0,0,0,0,0,0,0,0,0,0]
[null,"Week 6","@ Seattle Seahawks","Kyler Murray",0,15,10,3,0,0,0,0,0,0,0,0,0,0,0,0,0,0,0,0,0,0]
[null,"Week 7","New Orleans Saints","Kyler Murray",0,12,7,9,0,0,0,0,1,0,0,0,0,0,0,0,0,0,0,0,0,0]
[null,"Week 8","@ Minnesota Vikings","Kyler Murray",0,9,6,0,5,0,0,0,0,2,0,0,0,0,0,0,0,0,0,0,0,0]
[null,"Week 9","Seattle Seahawks","Kyler Murray",7,4,8,1,0,0,0,0,1,0,0,0,0,0,0,0,0,0,0,0,0,0]
[null,"Week 10","@ Los Angeles Rams","Colt McCoy",21,0,0,1,0,0,0,4,0,0,0,0,0,0,0,0,0,0,0,0,0,0]
[null,"Week 11","San Francisco 49ers","Colt McCoy",14,0,0,5,0,0,1,3,0,1,0,0,0,0,0,0,0,0,0,0,0,0]
[null,"Week 12","Los Angeles Chargers","Kyler Murray",25,0,7,2,0,0,0,0,0,0,0,0,0,0,0,0,0,0,0,0,0,0]
[null,"Week 13","BYE",""]
[null,"Week 14","New England Patriots","Colt McCoy",15,0,1,1,0,0,0,5,0,0,0,0,0,0,0,0,0,0,0,0,0,0]
[null,"Week 15","@ Denver Broncos","Colt McCoy",16,0,0,1,0,0,1,2,0,0,0,0,0,0,0,0,0,0,0,0,0,0]
[null,"Week 16","Tampa Bay Buccaneers","Trace McSorley",15,0,0,1,0,0,7,0,3,0,0,0,0,1,0,0,0,0,0,0,0,0]
[null,"Week 17","@ Atlanta Falcons","David Blough",16,0,0,0,0,7,0,0,0,0,0,2,2,0,0,0,0,0,0,0,0,0]
[null,"Week 18","@ San Francisco 49ers","David Blough",0,0,0,3,0,8,3,0,2,0,0,2,2,0,0,0,0,0,0,0,0,0]
[]
[null,"Total",null,null,183,70,67,27,21,15,15,14,7,6,0,4,4,1,0,0,0,0,0,0,0,0]
[]
[null,"Rush Att Share (%)","Opponent","QB","James Conner","Eno Benjamin","Kyler Murray","Keaontay Ingram","Darrel Williams","Corey Clement","Trace McSorley","Colt McCoy","Greg Dortch","Rondale Moore","Jonathan Ward","David Blough","Pharoh Cooper","Marquise Brown","Andy Isabella","","","","","","",""]
[null,"Week 1","Kansas City Chiefs","Kyler Murray",0.45454545454545453,0.18181818181818182,0.22727272727272727,0,0,0,0.13636363636363635,0,0,0,0,0,0,0,0,0,0,0,0,0,0,0]
[null,"Week 2","@ Las Vegas Raiders","Kyler Murray",0.25,0.2857142857142857,0.17857142857142858,0,0.2857142857142857,0,0,0,0,0,0,0,0,0,0,0,0,0,0,0,0,0]
[null,"Week 3","Los Angeles Rams","Kyler Murray",0.61904761904761907,0.23809523809523808,9.5238095238095233E-2,0,4.7619047619047616E-2,0,0,0,0,0,0,0,0,0,0,0,0,0,0,0,0,0]
[null,"Week 4","@ Carolina Panthers","Kyler Murray",0.40540540540540543,0.13513513513513514,0.32432432432432434,0,0.10810810810810811,0,0,0,0,2.7027027027027029E-2,0,0,0,0,0,0,0,0,0,0,0,0]
[null,"Week 5","Philadelphia Eagles","Kyler Murray",0.34615384615384615,0.30769230769230771,0.15384615384615385,0,0.11538461538461539,0,0,0,0,7.6923076923076927E-2,0,0,0,0,0,0,0,0,0,0,0,0]
[null,"Week 6","@ Seattle Seahawks","Kyler Murray",0,0.5357142857142857,0.35714285714285715,0.10714285714285714,0,0,0,0,0,0,0,0,0,0,0,0,0,0,0,0,0,0]
[null,"Week 7","New Orleans Saints","Kyler Murray",0,0.41379310344827586,0.2413793103448276,0.31034482758620691,0,0,0,0,3.4482758620689655E-2,0,0,0,0,0,0,0,0,0,0,0,0,0]
[null,"Week 8","@ Minnesota Vikings","Kyler Murray",0,0.40909090909090912,0.27272727272727271,0,0.22727272727272727,0,0,0,0,9.0909090909090912E-2,0,0,0,0,0,0,0,0,0,0,0,0]
[null,"Week 9","Seattle Seahawks","Kyler Murray",0.33333333333333331,0.19047619047619047,0.38095238095238093,4.7619047619047616E-2,0,0,0,0,4.7619047619047616E-2,0,0,0,0,0,0,0,0,0,0,0,0,0]
[null,"Week 10","@ Los Angeles Rams","Colt McCoy",0.80769230769230771,0,0,3.8461538461538464E-2,0,0,0,0.15384615384615385,0,0,0,0,0,0,0,0,0,0,0,0,0,0]
[null,"Week 11","San Francisco 49ers","Colt McCoy",0.58333333333333337,0,0,0.20833333333333334,0,0,4.1666666666666664E-2,0.125,0,4.1666666666666664E-2,0,0,0,0,0,0,0,0,0,0,0,0]
[null,"Week 12","Los Angeles Chargers","Kyler Murray",0.73529411764705888,0,0.20588235294117646,5.8823529411764705E-2,0,0,0,0,0,0,0,0,0,0,0,0,0,0,0,0,0,0]
[null,"Week 13","BYE",""]
[null,"Week 14","New England Patriots","Colt McCoy",0.68181818181818177,0,4.5454545454545456E-2,4.5454545454545456E-2,0,0,0,0.22727272727272727,0,0,0,0,0,0,0,0,0,0,0,0,0,0]
[null,"Week 15","@ Denver Broncos","Colt McCoy",0.8,0,0,0.05,0,0,0.05,0.1,0,0,0,0,0,0,0,0,0,0,0,0,0,0]
[null,"Week 16","Tampa Bay Buccaneers","Trace McSorley",0.55555555555555558,0,0,3.7037037037037035E-2,0,0,0.25925925925925924,0,0.1111111111111111,0,0,0,0,3.7037037037037035E-2,0,0,0,0,0,0,0,0]
[null,"Week 17","@ Atlanta Falcons","David Blough",0.59259259259259256,0,0,0,0,0.25925925925925924,0,0,0,0,0,7.407407407407407E-2,7.407407407407407E-2,0,0,0,0,0,0,0,0,0]
[null,"Week 18","@ San Francisco 49ers","David Blough",0,0,0,0.15,0,0.4,0.15,0,0.1,0,0,0.1,0.1,0,0,0,0,0,0,0,0,0]
[]
[null,"Total",null,null,0.42165898617511521,0.16129032258064516,0.15437788018433179,6.2211981566820278E-2,4.8387096774193547E-2,3.4562211981566823E-2,3.4562211981566823E-2,3.2258064516129031E-2,1.6129032258064516E-2,1.3824884792626729E-2,0,9.2165898617511521E-3,9.2165898617511521E-3,2.304147465437788E-3,0,0,0,0,0,0,0,0]
[]
[null,"YPC","Opponent","QB","James Conner","Eno Benjamin","Kyler Murray","Keaontay Ingram","Darrel Williams","Corey Clement","Trace McSorley","Colt McCoy","Greg Dortch","Rondale Moore","Jonathan Ward","David Blough","Pharoh Cooper","Marquise Brown","Andy Isabella","","","","","","",""]
[null,"Week 1","Kansas City Chiefs","Kyler Murray",2.6,7,5.8,0,0,0,6.666666666666667,0,0,0,0,0,0,0,0,0,0,0,0,0,0,0]
[null,"Week 2","@ Las Vegas Raiders","Kyler Murray",3.5714285714285716,3.875,5.6,0,7.375,0,0,0,0,0,0,0,0,0,0,0,0,0,0,0,0,0]
[null,"Week 3","Los Angeles Rams","Kyler Murray",3,3.2,4,0,7,0,0,0,0,0,0,0,0,0,0,0,0,0,0,0,0,0]
[null,"Week 4","@ Carolina Panthers","Kyler Murray",3.6666666666666665,7.2,2.1666666666666665,0,4.75,0,0,0,0,-4,0,0,0,0,0,0,0,0,0,0,0,0]
[null,"Week 5","Philadelphia Eagles","Kyler Murray",6.1111111111111107,3.125,10.5,0,3,0,0,0,0,-3.5,0,0,0,0,0,0,0,0,0,0,0,0]
[null,"Week 6","@ Seattle Seahawks","Kyler Murray",0,2.4666666666666668,10,2.3333333333333335,0,0,0,0,0,0,0,0,0,0,0,0,0,0,0,0,0,0]
[null,"Week 7","New Orleans Saints","Kyler Murray",0,7.666666666666667,4.2857142857142856,1.5555555555555556,0,0,0,0,1,0,0,0,0,0,0,0,0,0,0,0,0,0]
[null,"Week 8","@ Minnesota Vikings","Kyler Murray",0,2.4444444444444446,6,0,1.6,0,0,0,0,6,0,0,0,0,0,0,0,0,0,0,0,0]
[null,"Week 9","Seattle Seahawks","Kyler Murray",6.4285714285714288,3,7.5,2,0,0,0,0,3,0,0,0,0,0,0,0,0,0,0,0,0,0]
[null,"Week 10","@ Los Angeles Rams","Colt McCoy",3.2857142857142856,0,0,5,0,0,0,1,0,0,0,0,0,0,0,0,0,0,0,0,0,0]
[null,"Week 11","San Francisco 49ers","Colt McCoy",3,0,0,3.8,0,0,6,2,0,-6,0,0,0,0,0,0,0,0,0,0,0,0]
[null,"Week 12","Los Angeles Chargers","Kyler Murray",4.8,0,8,2.5,0,0,0,0,0,0,0,0,0,0,0,0,0,0,0,0,0,0]
[null,"Week 13","BYE",""]
[null,"Week 14","New England Patriots","Colt McCoy",5.666666666666667,0,3,1,0,0,0,4.8,0,0,0,0,0,0,0,0,0,0,0,0,0,0]
[null,"Week 15","@ Denver Broncos","Colt McCoy",3.9375,0,0,0,0,0,8,1,0,0,0,0,0,0,0,0,0,0,0,0,0,0]
[null,"Week 16","Tampa Bay Buccaneers","Trace McSorley",5.2666666666666666,0,0,2,0,0,2,0,8.3333333333333339,0,0,0,0,1,0,0,0,0,0,0,0,0]
[null,"Week 17","@ Atlanta Falcons","David Blough",4.9375,0,0,0,0,4.5714285714285712,0,0,0,0,0,3.5,4,0,0,0,0,0,0,0,0,0]
[null,"Week 18","@ San Francisco 49ers","David Blough",0,0,0,1.6666666666666667,0,2.875,4.333333333333333,0,7.5,0,0,-1,3.5,0,0,0,0,0,0,0,0,0]
[]
[null,"Total",null,null,4.2732240437158469,4.0649350649350646,6.2388059701492535,2.2222222222222223,4.8571428571428568,3.6666666666666665,4.0666666666666664,2.5714285714285716,6.2857142857142856,-0.83333333333333337,5,1.25,3.75,1,1,0,0,0,0,0,0,0]
[]
[null,"RZ Rush (Inside 20)","Opponent","QB","James Conner","Eno Benjamin","Kyler Murray","Keaontay Ingram","Darrel Williams","Corey Clement","Trace McSorley","Colt McCoy","Greg Dortch","Rondale Moore","Jonathan Ward","David Blough","Pharoh Cooper","Marquise Brown","Andy Isabella","","","","","","",""]
[null,"Week 1","Kansas City Chiefs","Kyler Murray",3,0,0,0,0,0,0,0,0,0,0,0,0,0,0,0,0,0,0,0,0,0]
[null,"Week 2","@ Las Vegas Raiders","Kyler Murray",0,3,1,0,1,0,0,0,0,0,0,0,0,0,0,0,0,0,0,0,0,0]
[null,"Week 3","Los Angeles Rams","Kyler Murray",2,0,0,0,0,0,0,0,0,0,0,0,0,0,0,0,0,0,0,0,0,0]
[null,"Week 4","@ Carolina Panthers","Kyler Murray",2,2,3,0,0,0,0,0,0,1,0,0,0,0,0,0,0,0,0,0,0,0]
[null,"Week 5","Philadelphia Eagles","Kyler Murray",1,1,0,0,0,0,0,0,0,0,0,0,0,0,0,0,0,0,0,0,0,0]
[null,"Week 6","@ Seattle Seahawks","Kyler Murray",0,1,1,1,0,0,0,0,0,0,0,0,0,0,0,0,0,0,0,0,0,0]
[null,"Week 7","New Orleans Saints","Kyler Murray",0,4,4,4,0,0,0,0,0,0,0,0,0,0,0,0,0,0,0,0,0,0]
[null,"Week 8","@ Minnesota Vikings","Kyler Murray",0,1,2,0,3,0,0,0,0,0,0,0,0,0,0,0,0,0,0,0,0,0]
[null,"Week 9","Seattle Seahawks","Kyler Murray",0,0,0,0,0,0,0,0,1,0,0,0,0,0,0,0,0,0,0,0,0,0]
[null,"Week 10","@ Los Angeles Rams","Colt McCoy",7,0,0,0,0,0,0,2,0,0,0,0,0,0,0,0,0,0,0,0,0,0]
[null,"Week 11","San Francisco 49ers","Colt McCoy",2,0,0,1,0,0,0,0,0,0,0,0,0,0,0,0,0,0,0,0,0,0]
[null,"Week 12","Los Angeles Chargers","Kyler Murray",2,0,1,0,0,0,0,0,0,0,0,0,0,0,0,0,0,0,0,0,0,0]
[null,"Week 13","BYE",""]
[null,"Week 14","New England Patriots","Colt McCoy",1,0,0,1,0,0,0,0,0,0,0,0,0,0,0,0,0,0,0,0,0,0]
[null,"Week 15","@ Denver Broncos","Colt McCoy",2,0,0,0,0,0,0,0,0,0,0,0,0,0,0,0,0,0,0,0,0,0]
[null,"Week 16","Tampa Bay Buccaneers","Trace McSorley",0,0,0,1,0,0,1,0,0,0,0,0,0,0,0,0,0,0,0,0,0,0]
[null,"Week 17","@ Atlanta Falcons","David Blough",1,0,0,0,0,0,0,0,0,0,0,0,0,0,0,0,0,0,0,0,0,0]
[null,"Week 18","@ San Francisco 49ers","David Blough",0,0,0,0,0,3,0,0,1,0,0,0,0,0,0,0,0,0,0,0,0,0]
[]
[null,"Total",null,null,23,12,12,8,4,3,1,2,2,1,0,0,0,0,0,0,0,0,0,0,0,0]
[]
[null,"RZ Rush % (Inside 20)","Opponent","QB","James Conner","Eno Benjamin","Kyler Murray","Keaontay Ingram","Darrel Williams","Corey Clement","Trace McSorley","Colt McCoy","Greg Dortch","Rondale Moore","Jonathan Ward","David Blough","Pharoh Cooper","Marquise Brown","Andy Isabella","","","","","","",""]
[null,"Week 1","Kansas City Chiefs","Kyler Murray",1,0,0,0,0,0,0,0,0,0,0,0,0,0,0,0,0,0,0,0,0,0]
[null,"Week 2","@ Las Vegas Raiders","Kyler Murray",0,0.6,0.2,0,0.2,0,0,0,0,0,0,0,0,0,0,0,0,0,0,0,0,0]
[null,"Week 3","Los Angeles Rams","Kyler Murray",1,0,0,0,0,0,0,0,0,0,0,0,0,0,0,0,0,0,0,0,0,0]
[null,"Week 4","@ Carolina Panthers","Kyler Murray",0.25,0.25,0.375,0,0,0,0,0,0,0.125,0,0,0,0,0,0,0,0,0,0,0,0]
[null,"Week 5","Philadelphia Eagles","Kyler Murray",0.5,0.5,0,0,0,0,0,0,0,0,0,0,0,0,0,0,0,0,0,0,0,0]
[null,"Week 6","@ Seattle Seahawks","Kyler Murray",0,0.33333333333333331,0.33333333333333331,0.33333333333333331,0,0,0,0,0,0,0,0,0,0,0,0,0,0,0,0,0,0]
[null,"Week 7","New Orleans Saints","Kyler Murray",0,0.33333333333333331,0.33333333333333331,0.33333333333333331,0,0,0,0,0,0,0,0,0,0,0,0,0,0,0,0,0,0]
[null,"Week 8","@ Minnesota Vikings","Kyler Murray",0,0.16666666666666666,0.33333333333333331,0,0.5,0,0,0,0,0,0,0,0,0,0,0,0,0,0,0,0,0]
[null,"Week 9","Seattle Seahawks","Kyler Murray",0,0,0,0,0,0,0,0,1,0,0,0,0,0,0,0,0,0,0,0,0,0]
[null,"Week 10","@ Los Angeles Rams","Colt McCoy",0.77777777777777779,0,0,0,0,0,0,0.22222222222222221,0,0,0,0,0,0,0,0,0,0,0,0,0,0]
[null,"Week 11","San Francisco 49ers","Colt McCoy",0.66666666666666663,0,0,0.33333333333333331,0,0,0,0,0,0,0,0,0,0,0,0,0,0,0,0,0,0]
[null,"Week 12","Los Angeles Chargers","Kyler Murray",0.66666666666666663,0,0.33333333333333331,0,0,0,0,0,0,0,0,0,0,0,0,0,0,0,0,0,0,0]
[null,"Week 13","BYE",""]
[null,"Week 14","New England Patriots","Colt McCoy",0.5,0,0,0.5,0,0,0,0,0,0,0,0,0,0,0,0,0,0,0,0,0,0]
[null,"Week 15","@ Denver Broncos","Colt McCoy",1,0,0,0,0,0,0,0,0,0,0,0,0,0,0,0,0,0,0,0,0,0]
[null,"Week 16","Tampa Bay Buccaneers","Trace McSorley",0,0,0,0.5,0,0,0.5,0,0,0,0,0,0,0,0,0,0,0,0,0,0,0]
[null,"Week 17","@ Atlanta Falcons","David Blough",1,0,0,0,0,0,0,0,0,0,0,0,0,0,0,0,0,0,0,0,0,0]
[null,"Week 18","@ San Francisco 49ers","David Blough",0,0,0,0,0,0.75,0,0,0.25,0,0,0,0,0,0,0,0,0,0,0,0,0]
[]
[null,"Total",null,null,0.33823529411764708,0.17647058823529413,0.17647058823529413,0.11764705882352941,5.8823529411764705E-2,4.4117647058823532E-2,1.4705882352941176E-2,2.9411764705882353E-2,2.9411764705882353E-2,1.4705882352941176E-2,0,0,0,0,0,0,0,0,0,0,0,0]
[]
[null,"RZ Rush (Inside 10)","Opponent","QB","James Conner","Eno Benjamin","Kyler Murray","Keaontay Ingram","Darrel Williams","Corey Clement","Trace McSorley","Colt McCoy","Greg Dortch","Rondale Moore","Jonathan Ward","David Blough","Pharoh Cooper","Marquise Brown","Andy Isabella","","","","","","",""]
[null,"Week 1","Kansas City Chiefs","Kyler Murray",2,0,0,0,0,0,0,0,0,0,0,0,0,0,0,0,0,0,0,0,0,0]
[null,"Week 2","@ Las Vegas Raiders","Kyler Murray",0,1,1,0,1,0,0,0,0,0,0,0,0,0,0,0,0,0,0,0,0,0]
[null,"Week 3","Los Angeles Rams","Kyler Murray",2,0,0,0,0,0,0,0,0,0,0,0,0,0,0,0,0,0,0,0,0,0]
[null,"Week 4","@ Carolina Panthers","Kyler Murray",2,0,1,0,0,0,0,0,0,1,0,0,0,0,0,0,0,0,0,0,0,0]
[null,"Week 5","Philadelphia Eagles","Kyler Murray",1,0,0,0,0,0,0,0,0,0,0,0,0,0,0,0,0,0,0,0,0,0]
[null,"Week 6","@ Seattle Seahawks","Kyler Murray",0,1,1,0,0,0,0,0,0,0,0,0,0,0,0,0,0,0,0,0,0,0]
[null,"Week 7","New Orleans Saints","Kyler Murray",0,3,1,2,0,0,0,0,0,0,0,0,0,0,0,0,0,0,0,0,0,0]
[null,"Week 8","@ Minnesota Vikings","Kyler Murray",0,0,0,0,0,0,0,0,0,0,0,0,0,0,0,0,0,0,0,0,0,0]
[null,"Week 9","Seattle Seahawks","Kyler Murray",0,0,0,0,0,0,0,0,1,0,0,0,0,0,0,0,0,0,0,0,0,0]
[null,"Week 10","@ Los Angeles Rams","Colt McCoy",2,0,0,0,0,0,0,1,0,0,0,0,0,0,0,0,0,0,0,0,0,0]
[null,"Week 11","San Francisco 49ers","Colt McCoy",1,0,0,0,0,0,0,0,0,0,0,0,0,0,0,0,0,0,0,0,0,0]
[null,"Week 12","Los Angeles Chargers","Kyler Murray",1,0,1,0,0,0,0,0,0,0,0,0,0,0,0,0,0,0,0,0,0,0]
[null,"Week 13","BYE",""]
[null,"Week 14","New England Patriots","Colt McCoy",1,0,0,0,0,0,0,0,0,0,0,0,0,0,0,0,0,0,0,0,0,0]
[null,"Week 15","@ Denver Broncos","Colt McCoy",2,0,0,0,0,0,0,0,0,0,0,0,0,0,0,0,0,0,0,0,0,0]
[null,"Week 16","Tampa Bay Buccaneers","Trace McSorley",0,0,0,0,0,0,0,0,0,0,0,0,0,0,0,0,0,0,0,0,0,0]
[null,"Week 17","@ Atlanta Falcons","David Blough",1,0,0,0,0,0,0,0,0,0,0,0,0,0,0,0,0,0,0,0,0,0]
[null,"Week 18","@ San Francisco 49ers","David Blough",0,0,0,0,0,3,0,0,0,0,0,0,0,0,0,0,0,0,0,0,0,0]
[]
[null,"Total",null,null,15,5,5,2,1,3,0,1,1,1,0,0,0,0,0,0,0,0,0,0,0,0]
[]
[null,"RZ Rush % (Inside 10)","Opponent","QB","James Conner","Eno Benjamin","Kyler Murray","Keaontay Ingram","Darrel Williams","Corey Clement","Trace McSorley","Colt McCoy","Greg Dortch","Rondale Moore","Jonathan Ward","David Blough","Pharoh Cooper","Marquise Brown","Andy Isabella","","","","","","",""]
[null,"Week 1","Kansas City Chiefs","Kyler Murray",1,0,0,0,0,0,0,0,0,0,0,0,0,0,0,0,0,0,0,0,0,0]
[null,"Week 2","@ Las Vegas Raiders","Kyler Murray",0,0.33333333333333331,0.33333333333333331,0,0.33333333333333331,0,0,0,0,0,0,0,0,0,0,0,0,0,0,0,0,0]
[null,"Week 3","Los Angeles Rams","Kyler Murray",1,0,0,0,0,0,0,0,0,0,0,0,0,0,0,0,0,0,0,0,0,0]
[null,"Week 4","@ Carolina Panthers","Kyler Murray",0.5,0,0.25,0,0,0,0,0,0,0.25,0,0,0,0,0,0,0,0,0,0,0,0]
[null,"Week 5","Philadelphia Eagles","Kyler Murray",1,0,0,0,0,0,0,0,0,0,0,0,0,0,0,0,0,0,0,0,0,0]
[null,"Week 6","@ Seattle Seahawks","Kyler Murray",0,0.5,0.5,0,0,0,0,0,0,0,0,0,0,0,0,0,0,0,0,0,0,0]
[null,"Week 7","New Orleans Saints","Kyler Murray",0,0.5,0.16666666666666666,0.33333333333333331,0,0,0,0,0,0,0,0,0,0,0,0,0,0,0,0,0,0]
[null,"Week 8","@ Minnesota Vikings","Kyler Murray",0,0,0,0,0,0,0,0,0,0,0,0,0,0,0,0,0,0,0,0,0,0]
[null,"Week 9","Seattle Seahawks","Kyler Murray",0,0,0,0,0,0,0,0,1,0,0,0,0,0,0,0,0,0,0,0,0,0]
[null,"Week 10","@ Los Angeles Rams","Colt McCoy",0.66666666666666663,0,0,0,0,0,0,0.33333333333333331,0,0,0,0,0,0,0,0,0,0,0,0,0,0]
[null,"Week 11","San Francisco 49ers","Colt McCoy",1,0,0,0,0,0,0,0,0,0,0,0,0,0,0,0,0,0,0,0,0,0]
[null,"Week 12","Los Angeles Chargers","Kyler Murray",0.5,0,0.5,0,0,0,0,0,0,0,0,0,0,0,0,0,0,0,0,0,0,0]
[null,"Week 13","BYE",""]
[null,"Week 14","New England Patriots","Colt McCoy",1,0,0,0,0,0,0,0,0,0,0,0,0,0,0,0,0,0,0,0,0,0]
[null,"Week 15","@ Denver Broncos","Colt McCoy",1,0,0,0,0,0,0,0,0,0,0,0,0,0,0,0,0,0,0,0,0,0]
[null,"Week 16","Tampa Bay Buccaneers","Trace McSorley",0,0,0,0,0,0,0,0,0,0,0,0,0,0,0,0,0,0,0,0,0,0]
[null,"Week 17","@ Atlanta Falcons","David Blough",1,0,0,0,0,0,0,0,0,0,0,0,0,0,0,0,0,0,0,0,0,0]
[null,"Week 18","@ San Francisco 49ers","David Blough",0,0,0,0,0,1,0,0,0,0,0,0,0,0,0,0,0,0,0,0,0,0]
[]
[null,"Total",null,null,0.44117647058823528,0.14705882352941177,0.14705882352941177,5.8823529411764705E-2,2.9411764705882353E-2,8.8235294117647065E-2,0,2.9411764705882353E-2,2.9411764705882353E-2,2.9411764705882353E-2,0,0,0,0,0,0,0,0,0,0,0,0]
[]
[null,"RZ Rush (Inside 5)","Opponent","QB","James Conner","Eno Benjamin","Kyler Murray","Keaontay Ingram","Darrel Williams","Corey Clement","Trace McSorley","Colt McCoy","Greg Dortch","Rondale Moore","Jonathan Ward","David Blough","Pharoh Cooper","Marquise Brown","Andy Isabella","","","","","","",""]
[null,"Week 1","Kansas City Chiefs","Kyler Murray",1,0,0,0,0,0,0,0,0,0,0,0,0,0,0,0,0,0,0,0,0,0]
[null,"Week 2","@ Las Vegas Raiders","Kyler Murray",0,0,1,0,1,0,0,0,0,0,0,0,0,0,0,0,0,0,0,0,0,0]
[null,"Week 3","Los Angeles Rams","Kyler Murray",1,0,0,0,0,0,0,0,0,0,0,0,0,0,0,0,0,0,0,0,0,0]
[null,"Week 4","@ Carolina Panthers","Kyler Murray",1,0,1,0,0,0,0,0,0,0,0,0,0,0,0,0,0,0,0,0,0,0]
[null,"Week 5","Philadelphia Eagles","Kyler Murray",0,0,0,0,0,0,0,0,0,0,0,0,0,0,0,0,0,0,0,0,0,0]
[null,"Week 6","@ Seattle Seahawks","Kyler Murray",0,1,1,0,0,0,0,0,0,0,0,0,0,0,0,0,0,0,0,0,0,0]
[null,"Week 7","New Orleans Saints","Kyler Murray",0,0,1,2,0,0,0,0,0,0,0,0,0,0,0,0,0,0,0,0,0,0]
[null,"Week 8","@ Minnesota Vikings","Kyler Murray",0,0,0,0,0,0,0,0,0,0,0,0,0,0,0,0,0,0,0,0,0,0]
[null,"Week 9","Seattle Seahawks","Kyler Murray",0,0,0,0,0,0,0,0,1,0,0,0,0,0,0,0,0,0,0,0,0,0]
[null,"Week 10","@ Los Angeles Rams","Colt McCoy",1,0,0,0,0,0,0,0,0,0,0,0,0,0,0,0,0,0,0,0,0,0]
[null,"Week 11","San Francisco 49ers","Colt McCoy",1,0,0,0,0,0,0,0,0,0,0,0,0,0,0,0,0,0,0,0,0,0]
[null,"Week 12","Los Angeles Chargers","Kyler Murray",0,0,0,0,0,0,0,0,0,0,0,0,0,0,0,0,0,0,0,0,0,0]
[null,"Week 13","BYE",""]
[null,"Week 14","New England Patriots","Colt McCoy",0,0,0,0,0,0,0,0,0,0,0,0,0,0,0,0,0,0,0,0,0,0]
[null,"Week 15","@ Denver Broncos","Colt McCoy",1,0,0,0,0,0,0,0,0,0,0,0,0,0,0,0,0,0,0,0,0,0]
[null,"Week 16","Tampa Bay Buccaneers","Trace McSorley",0,0,0,0,0,0,0,0,0,0,0,0,0,0,0,0,0,0,0,0,0,0]
[null,"Week 17","@ Atlanta Falcons","David Blough",0,0,0,0,0,0,0,0,0,0,0,0,0,0,0,0,0,0,0,0,0,0]
[null,"Week 18","@ San Francisco 49ers","David Blough",0,0,0,0,0,1,0,0,0,0,0,0,0,0,0,0,0,0,0,0,0,0]
[]
[null,"Total",null,null,6,1,4,2,1,1,0,0,1,0,0,0,0,0,0,0,0,0,0,0,0,0]
[]
[null,"RZ Rush % (Inside 5)","Opponent","QB","James Conner","Eno Benjamin","Kyler Murray","Keaontay Ingram","Darrel Williams","Corey Clement","Trace McSorley","Colt McCoy","Greg Dortch","Rondale Moore","Jonathan Ward","David Blough","Pharoh Cooper","Marquise Brown","Andy Isabella","","","","","","",""]
[null,"Week 1","Kansas City Chiefs","Kyler Murray",1,0,0,0,0,0,0,0,0,0,0,0,0,0,0,0,0,0,0,0,0,0]
[null,"Week 2","@ Las Vegas Raiders","Kyler Murray",0,0,0.5,0,0.5,0,0,0,0,0,0,0,0,0,0,0,0,0,0,0,0,0]
[null,"Week 3","Los Angeles Rams","Kyler Murray",1,0,0,0,0,0,0,0,0,0,0,0,0,0,0,0,0,0,0,0,0,0]
[null,"Week 4","@ Carolina Panthers","Kyler Murray",0.5,0,0.5,0,0,0,0,0,0,0,0,0,0,0,0,0,0,0,0,0,0,0]
[null,"Week 5","Philadelphia Eagles","Kyler Murray",0,0,0,0,0,0,0,0,0,0,0,0,0,0,0,0,0,0,0,0,0,0]
[null,"Week 6","@ Seattle Seahawks","Kyler Murray",0,0.5,0.5,0,0,0,0,0,0,0,0,0,0,0,0,0,0,0,0,0,0,0]
[null,"Week 7","New Orleans Saints","Kyler Murray",0,0,0.33333333333333331,0.66666666666666663,0,0,0,0,0,0,0,0,0,0,0,0,0,0,0,0,0,0]
[null,"Week 8","@ Minnesota Vikings","Kyler Murray",0,0,0,0,0,0,0,0,0,0,0,0,0,0,0,0,0,0,0,0,0,0]
[null,"Week 9","Seattle Seahawks","Kyler Murray",0,0,0,0,0,0,0,0,1,0,0,0,0,0,0,0,0,0,0,0,0,0]
[null,"Week 10","@ Los Angeles Rams","Colt McCoy",1,0,0,0,0,0,0,0,0,0,0,0,0,0,0,0,0,0,0,0,0,0]
[null,"Week 11","San Francisco 49ers","Colt McCoy",1,0,0,0,0,0,0,0,0,0,0,0,0,0,0,0,0,0,0,0,0,0]
[null,"Week 12","Los Angeles Chargers","Kyler Murray",0,0,0,0,0,0,0,0,0,0,0,0,0,0,0,0,0,0,0,0,0,0]
[null,"Week 13","BYE",""]
[null,"Week 14","New England Patriots","Colt McCoy",0,0,0,0,0,0,0,0,0,0,0,0,0,0,0,0,0,0,0,0,0,0]
[null,"Week 15","@ Denver Broncos","Colt McCoy",1,0,0,0,0,0,0,0,0,0,0,0,0,0,0,0,0,0,0,0,0,0]
[null,"Week 16","Tampa Bay Buccaneers","Trace McSorley",0,0,0,0,0,0,0,0,0,0,0,0,0,0,0,0,0,0,0,0,0,0]
[null,"Week 17","@ Atlanta Falcons","David Blough",0,0,0,0,0,0,0,0,0,0,0,0,0,0,0,0,0,0,0,0,0,0]
[null,"Week 18","@ San Francisco 49ers","David Blough",0,0,0,0,0,1,0,0,0,0,0,0,0,0,0,0,0,0,0,0,0,0]
[]
[null,"Total",null,null,0.375,6.25E-2,0.25,0.125,6.25E-2,6.25E-2,0,0,6.25E-2,0,0,0,0,0,0,0,0,0,0,0,0,0]
[]
[null,"Total Opportunities (Carries + Targets)","Opponent","QB","James Conner","Eno Benjamin","Kyler Murray","Keaontay Ingram","Darrel Williams","Corey Clement","Trace McSorley","Colt McCoy","Greg Dortch","Rondale Moore","Jonathan Ward","David Blough","Pharoh Cooper","Marquise Brown","Andy Isabella","","","","","","",""]
[null,"Week 1","Kansas City Chiefs","Kyler Murray",16,8,5,0,0,0,3,0,9,0,0,0,0,6,3,0,0,0,0,0,0,0]
[null,"Week 2","@ Las Vegas Raiders","Kyler Murray",11,12,5,0,11,0,0,0,4,0,0,0,0,11,0,0,0,0,0,0,0,0]
[null,"Week 3","Los Angeles Rams","Kyler Murray",18,9,2,0,2,0,0,0,10,0,0,0,0,17,2,0,0,0,0,0,0,0]
[null,"Week 4","@ Carolina Panthers","Kyler Murray",18,6,12,0,5,0,0,0,1,6,0,0,0,11,0,0,0,0,0,0,0,0]
[null,"Week 5","Philadelphia Eagles","Kyler Murray",10,12,4,0,3,0,0,0,0,10,0,0,0,10,0,0,0,0,0,0,0,0]
[null,"Week 6","@ Seattle Seahawks","Kyler Murray",0,18,10,3,0,0,0,0,0,10,0,0,0,9,0,0,0,0,0,0,0,0]
[null,"Week 7","New Orleans Saints","Kyler Murray",0,17,7,11,0,0,0,0,2,2,0,0,0,0,0,0,0,0,0,0,0,0]
[null,"Week 8","@ Minnesota Vikings","Kyler Murray",0,16,6,0,8,0,0,0,3,10,0,0,0,0,0,0,0,0,0,0,0,0]
[null,"Week 9","Seattle Seahawks","Kyler Murray",12,5,8,1,0,0,0,0,2,10,0,0,0,0,0,0,0,0,0,0,0,0]
[null,"Week 10","@ Los Angeles Rams","Colt McCoy",24,0,0,1,0,0,0,4,0,13,0,0,0,0,0,0,0,0,0,0,0,0]
[null,"Week 11","San Francisco 49ers","Colt McCoy",19,0,0,5,0,0,1,3,10,1,0,0,0,0,0,0,0,0,0,0,0,0]
[null,"Week 12","Los Angeles Chargers","Kyler Murray",28,0,7,2,0,1,0,0,0,0,0,0,0,8,0,0,0,0,0,0,0,0]
[null,"Week 13","BYE",""]
[null,"Week 14","New England Patriots","Colt McCoy",22,0,1,1,0,1,0,5,0,0,0,0,0,8,0,0,0,0,0,0,0,0]
[null,"Week 15","@ Denver Broncos","Colt McCoy",21,0,0,1,0,0,1,2,0,0,0,0,0,8,0,0,0,0,0,0,0,0]
[null,"Week 16","Tampa Bay Buccaneers","Trace McSorley",23,0,0,1,0,0,7,0,14,0,0,0,0,7,0,0,0,0,0,0,0,0]
[null,"Week 17","@ Atlanta Falcons","David Blough",19,0,0,0,0,8,0,0,10,0,0,2,2,9,0,0,0,0,0,0,0,0]
[null,"Week 18","@ San Francisco 49ers","David Blough",0,0,0,6,0,12,3,0,6,0,0,2,4,4,0,0,0,0,0,0,0,0]
[]
[null,"Total",null,null,241,103,67,32,29,22,15,14,71,62,0,4,6,108,5,0,0,0,0,0,0,0]
[]
[null,"Total Opportunities (Market Share %)","Opponent","QB","James Conner","Eno Benjamin","Kyler Murray","Keaontay Ingram","Darrel Williams","Corey Clement","Trace McSorley","Colt McCoy","Greg Dortch","Rondale Moore","Jonathan Ward","David Blough","Pharoh Cooper","Marquise Brown","Andy Isabella","","","","","","",""]
[null,"Week 1","Kansas City Chiefs","Kyler Murray",0.26666666666666666,0.13333333333333333,8.3333333333333329E-2,0,0,0,0.05,0,0.15,0,0,0,0,0.1,0.05,0,0,0,0,0,0,0]
[null,"Week 2","@ Las Vegas Raiders","Kyler Murray",0.14285714285714285,0.15584415584415584,6.4935064935064929E-2,0,0.14285714285714285,0,0,0,5.1948051948051951E-2,0,0,0,0,0.14285714285714285,0,0,0,0,0,0,0,0]
[null,"Week 3","Los Angeles Rams","Kyler Murray",0.22784810126582278,0.11392405063291139,2.5316455696202531E-2,0,2.5316455696202531E-2,0,0,0,0.12658227848101267,0,0,0,0,0.21518987341772153,2.5316455696202531E-2,0,0,0,0,0,0,0]
[null,"Week 4","@ Carolina Panthers","Kyler Murray",0.2608695652173913,8.6956521739130432E-2,0.17391304347826086,0,7.2463768115942032E-2,0,0,0,1.4492753623188406E-2,8.6956521739130432E-2,0,0,0,0.15942028985507245,0,0,0,0,0,0,0,0]
[null,"Week 5","Philadelphia Eagles","Kyler Murray",0.14705882352941177,0.17647058823529413,5.8823529411764705E-2,0,4.4117647058823532E-2,0,0,0,0,0.14705882352941177,0,0,0,0.14705882352941177,0,0,0,0,0,0,0,0]
[null,"Week 6","@ Seattle Seahawks","Kyler Murray",0,0.27692307692307694,0.15384615384615385,4.6153846153846156E-2,0,0,0,0,0,0.15384615384615385,0,0,0,0.13846153846153847,0,0,0,0,0,0,0,0]
[null,"Week 7","New Orleans Saints","Kyler Murray",0,0.29310344827586204,0.1206896551724138,0.18965517241379309,0,0,0,0,3.4482758620689655E-2,3.4482758620689655E-2,0,0,0,0,0,0,0,0,0,0,0,0]
[null,"Week 8","@ Minnesota Vikings","Kyler Murray",0,0.24242424242424243,9.0909090909090912E-2,0,0.12121212121212122,0,0,0,4.5454545454545456E-2,0.15151515151515152,0,0,0,0,0,0,0,0,0,0,0,0]
[null,"Week 9","Seattle Seahawks","Kyler Murray",0.21428571428571427,8.9285714285714288E-2,0.14285714285714285,1.7857142857142856E-2,0,0,0,0,3.5714285714285712E-2,0.17857142857142858,0,0,0,0,0,0,0,0,0,0,0,0]
[null,"Week 10","@ Los Angeles Rams","Colt McCoy",0.38095238095238093,0,0,1.5873015873015872E-2,0,0,0,6.3492063492063489E-2,0,0.20634920634920634,0,0,0,0,0,0,0,0,0,0,0,0]
[null,"Week 11","San Francisco 49ers","Colt McCoy",0.27941176470588236,0,0,7.3529411764705885E-2,0,0,1.4705882352941176E-2,4.4117647058823532E-2,0.14705882352941177,1.4705882352941176E-2,0,0,0,0,0,0,0,0,0,0,0,0]
[null,"Week 12","Los Angeles Chargers","Kyler Murray",0.44444444444444442,0,0.1111111111111111,3.1746031746031744E-2,0,1.5873015873015872E-2,0,0,0,0,0,0,0,0.12698412698412698,0,0,0,0,0,0,0,0]
[null,"Week 13","BYE",""]
[null,"Week 14","New England Patriots","Colt McCoy",0.34920634920634919,0,1.5873015873015872E-2,1.5873015873015872E-2,0,1.5873015873015872E-2,0,7.9365079365079361E-2,0,0,0,0,0,0.12698412698412698,0,0,0,0,0,0,0,0]
[null,"Week 15","@ Denver Broncos","Colt McCoy",0.375,0,0,1.7857142857142856E-2,0,0,1.7857142857142856E-2,3.5714285714285712E-2,0,0,0,0,0,0.14285714285714285,0,0,0,0,0,0,0,0]
[null,"Week 16","Tampa Bay Buccaneers","Trace McSorley",0.31506849315068491,0,0,1.3698630136986301E-2,0,0,9.5890410958904104E-2,0,0.19178082191780821,0,0,0,0,9.5890410958904104E-2,0,0,0,0,0,0,0,0]
[null,"Week 17","@ Atlanta Falcons","David Blough",0.28358208955223879,0,0,0,0,0.11940298507462686,0,0,0.14925373134328357,0,0,2.9850746268656716E-2,2.9850746268656716E-2,0.13432835820895522,0,0,0,0,0,0,0,0]
[null,"Week 18","@ San Francisco 49ers","David Blough",0,0,0,0.1276595744680851,0,0.25531914893617019,6.3829787234042548E-2,0,0.1276595744680851,0,0,4.2553191489361701E-2,8.5106382978723402E-2,8.5106382978723402E-2,0,0,0,0,0,0,0,0]
[]
[null,"Total",null,null,0.21948998178506376,9.3806921675774133E-2,6.1020036429872498E-2,2.9143897996357013E-2,2.6411657559198543E-2,2.0036429872495445E-2,1.3661202185792349E-2,1.2750455373406194E-2,6.466302367941712E-2,5.6466302367941715E-2,0,3.6429872495446266E-3,5.4644808743169399E-3,9.8360655737704916E-2,4.5537340619307837E-3,0,0,0,0,0,0,0]

{"sheet":"INPUTS","index":8,"n_rows":526,"n_cols":106,"rows_kept":526,"cut":false,"hidden":true,"merged":[[1,36,1,37],[1,38,1,44],[1,72,1,73],[1,74,1,85]]}
["Wins","Touchdowns",null,null,"PASSING",null,null,null,null,null,null,null,null,null,null,null,null,null,null,null,null,null,null,null,null,null,null,null,null,null,null,null,null,null,null,null,"RUSHING",null,null,null,null,null,null,null,null,null,null,null,null,null,null,null,"RECEIVING",null,null,null,null,null,null,null,null,null,null,null,null,null,null,null,null,null,null,null,"Advanced Passing",null,null,null,null,null,null,null,null,null,null,null,null,null,null,null,null,null,null,null,null,"Tiers"]
[1,30,null,null,null,null,null,null,null,null,null,null,null,null,null,null,null,null,null,null,null,null,null,null,null,null,null,null,null,null,null,null,null,null,null,null,"Games",null,"Rushing",null,null,null,null,null,null,null,null,null,null,null,null,null,"Rk","Player","Tm","Age","Pos","G","GS","Tgt","Rec","Ctch%","Yds","Y/R","TD","1D","Lng","Y/Tgt","R/G","Y/G","Fmb",null,"Games",null,"Passing"]
[1.5,30,null,null,"Rk","Player","Tm","Age","Pos","G","GS","QBrec","Cmp","Att","Cmp%","Yds","TD","TD%","Int","Int%","1D","Lng","Y/A","AY/A","Y/C","Y/G","Rate","QBR","Sk","Yds","Sk%","NY/A","ANY/A","4QC","GWD",null,"Rk","Player","Tm","Age","Pos","G","GS","Att","Yds","TD","1D","Lng","Y/A","Y/G","Fmb",null,1,"Justin Jefferson","MIN",23,"WR",17,17,184,128,0.69599999999999995,1809,14.1,8,80,64,9.8000000000000007,7.5,106.4,0,null,"Rk","Player","Tm","Age","Pos","G","GS","Cmp","Att","Yds","Bats","ThAwy","Spikes","Drops","Drop%","BadTh","Bad%","OnTgt","OnTgt%",null,null,"Wide Receiver",null,null,"Running Back",null,null,null,"Tight End",null,null,"Quarterback"]
[2,30,null,null,1,"Patrick Mahomes","KAN",27,"QB",17,17,"2000-03-14",435,648,67.099999999999994,5250,41,6.3,12,1.9,272,67,8.1,8.5,12.1,308.8,105.2,77.599999999999994,26,188,3.9,7.51,7.93,4,4,null,1,"Derrick Henry ","TEN",28,"RB",16,16,349,1538,13,65,56,4.4000000000000004,96.1,6,null,2,"Tyreek Hill","MIA",28,"WR",17,17,170,119,0.7,1710,14.4,7,77,64,10.1,7,100.6,1,null,1,"Patrick Mahomes","KAN",27,"QB",17,17,435,648,5250,8,33,0,33,5.3999999999999999E-2,95,0.154,474,0.77100000000000002,null,null,"Targets","Tier",null,"Carries","Targets","Tier",null,"Targets","Tier",null,"Carries","Pass Att","Tier"]
[2.5,30,null,null,2,"Justin Herbert","LAC",24,"QB",17,17,"2000-07-10",477,699,68.2,4739,25,3.6,10,1.4,228,55,6.8,6.9,9.9,278.8,93.2,58.2,38,206,5.2,6.15,6.22,4,5,null,2,"Josh Jacobs","LVR",24,"RB",17,17,340,1653,12,93,86,4.9000000000000004,97.2,3,null,3,"Travis Kelce","KAN",33,"TE",17,17,152,110,0.72399999999999998,1338,12.2,12,78,52,8.8000000000000007,6.5,78.7,1,null,2,"Justin Herbert","LAC",24,"QB",17,17,477,699,4739,23,25,2,39,5.8000000000000003E-2,87,0.129,508,0.75600000000000001,null,null,150,"Elite WR",null,300,0,"Elite RB",null,100,"Top TE",null,100,0,"Top QB"]
[3,30,null,null,3,"Tom Brady","TAM",45,"QB",17,17,"2000-09-08",490,733,66.8,4694,25,3.4,9,1.2,237,63,6.4,6.5,9.6,276.10000000000002,90.7,52.5,22,160,2.9,6.01,6.13,4,5,null,3,"Nick Chubb","CLE",27,"RB",17,17,302,1525,12,69,41,5,89.7,1,null,4,"Stefon Diggs","BUF",29,"WR",16,16,154,108,0.70099999999999996,1429,13.2,11,74,53,9.3000000000000007,6.8,89.3,1,null,3,"Tom Brady","TAM",45,"QB",17,17,490,733,4694,11,22,4,32,4.4999999999999998E-2,116,0.16400000000000001,545,0.77100000000000002,null,null,130,"2nd Tier WR1",null,200,100,"Elite RB",null,80,"2nd Tier TE1",null,500,50,"Top QB"]
[3.5,30,null,null,4,"Kirk Cousins","MIN",34,"QB",17,17,"2000-04-13",424,643,65.900000000000006,4547,29,4.5,14,2.2000000000000002,230,66,7.1,7,10.7,267.5,92.5,49.9,46,329,6.7,6.12,6.05,8,8,null,4,"Saquon Barkley","NYG",25,"RB",16,16,295,1312,10,62,68,4.4000000000000004,82,1,null,5,"Austin Ekeler","LAC",27,"RB",17,17,127,107,0.84299999999999997,722,6.7,5,36,23,5.7,6.3,42.5,5,null,4,"Kirk Cousins","MIN",34,"QB",17,17,424,643,4547,14,27,3,25,4.1000000000000002E-2,93,0.152,469,0.76500000000000001,null,null,110,"Consistent WR2",null,250,60,"Elite RB",null,null,null,null,500,0,"2nd Tier QB1"]
[4,30,null,null,5,"Joe Burrow","CIN",26,"QB",16,16,"2000-04-12",414,606,68.3,4475,35,5.8,12,2,222,60,7.4,7.6,10.8,279.7,100.8,58.7,41,259,6.3,6.52,6.76,3,4,null,5,"Najee Harris","PIT",24,"RB",17,17,272,1034,7,45,36,3.8,60.8,3,null,6,"CeeDee Lamb","DAL",23,"WR",17,17,156,107,0.68600000000000005,1359,12.7,9,67,39,8.6999999999999993,6.3,79.900000000000006,0,null,5,"Joe Burrow","CIN",26,"QB",16,16,414,606,4475,24,17,1,34,5.8000000000000003E-2,76,0.129,465,0.79100000000000004,null,null,null,null,null,200,60,"2nd Tier RB1"]
[4.5,30,null,null,6,"Jared Goff","DET",28,"QB",17,17,"2000-08-09",382,587,65.099999999999994,4438,29,4.9000000000000004,7,1.2,227,81,7.6,8,11.6,261.10000000000002,99.3,61.1,23,156,3.8,7.02,7.45,3,3,null,6,"Dalvin Cook","MIN",27,"RB",17,17,264,1173,8,50,81,4.4000000000000004,69,4,null,7,"Amon-Ra St. Brown","DET",23,"WR",16,16,146,106,0.72599999999999998,1161,11,6,68,49,8,6.6,72.599999999999994,0,null,6,"Jared Goff","DET",28,"QB",17,17,382,587,4438,11,27,1,34,6.0999999999999999E-2,94,0.16800000000000001,426,0.76200000000000001,null,null,null,null,null,200,0,"Consistent RB2"]
[5,30,null,null,7,"Josh Allen","BUF",26,"QB",16,16,"2000-03-13",359,567,63.3,4283,35,6.2,14,2.5,214,98,7.6,7.7,11.9,267.7,96.6,71.400000000000006,33,162,5.5,6.87,6.99,3,4,null,7,"Jamaal Williams","DET",27,"RB",17,9,262,1066,17,65,58,4.0999999999999996,62.7,3,null,8,"Chris Godwin","TAM",26,"WR",15,13,142,104,0.73199999999999998,1023,9.8000000000000007,3,53,44,7.2,6.9,68.2,2,null,7,"Josh Allen","BUF",26,"QB",16,16,359,567,4283,14,18,1,37,6.8000000000000005E-2,91,0.16600000000000001,404,0.73699999999999999,null,null,null,null,null,0,50,"Consistent RB2"]
[5.5,30,null,null,8,"Geno Smith","SEA",32,"QB",17,17,"2000-08-09",399,572,69.8,4282,30,5.2,11,1.9,206,54,7.5,7.7,10.7,251.9,100.9,60.8,46,348,7.4,6.37,6.54,2,3,null,8,"Miles Sanders","PHI",25,"RB",17,15,259,1269,11,62,40,4.9000000000000004,74.599999999999994,2,null,9,"Davante Adams","LVR",30,"WR",17,17,180,100,0.55600000000000005,1516,15.2,14,65,60,8.4,5.9,89.2,1,null,8,"Geno Smith","SEA",32,"QB",17,17,399,572,4282,11,20,1,18,3.3000000000000002E-2,65,0.11799999999999999,434,0.78800000000000003]
[6,30,null,null,9,"Trevor Lawrence","JAX",23,"QB",17,17,"2000-08-09",387,584,66.3,4113,25,4.3,8,1.4,206,59,7,7.3,10.6,241.9,95.2,54.5,27,184,4.4000000000000004,6.43,6.66,3,2,null,9,"Christian McCaffrey","2TM",26,"RB",17,16,244,1139,8,59,49,4.7,67,1,null,10,"Michael Pittman Jr.","IND",25,"WR",16,16,141,99,0.70199999999999996,925,9.3000000000000007,4,51,28,6.6,6.2,57.8,2,null,9,"Trevor Lawrence","JAX",23,"QB",17,17,387,584,4113,17,16,2,40,7.0999999999999994E-2,85,0.15,431,0.76100000000000001]
[6.5,30,null,null,10,"Jalen Hurts","PHI",24,"QB",15,15,"2000-01-14",306,460,66.5,3701,22,4.8,6,1.3,165,68,8,8.4,12.1,246.7,101.5,66.400000000000006,38,231,7.6,6.97,7.31,1,2,null,10,"Ezekiel Elliott","DAL",27,"RB",15,14,231,876,12,52,27,3.8,58.4,0,null,11,"DeVonta Smith","PHI",24,"WR",17,17,136,95,0.69899999999999995,1196,12.6,7,57,45,8.8000000000000007,5.6,70.400000000000006,1,null,10,"Jalen Hurts","PHI",24,"QB",15,15,306,460,3701,13,23,0,22,0.05,62,0.14199999999999999,340,0.77800000000000002]
[7,35,null,null,11,"Aaron Rodgers","GNB",39,"QB",17,17,"2000-09-08",350,542,64.599999999999994,3695,26,4.8,12,2.2000000000000002,177,58,6.8,6.8,10.6,217.4,91.1,39.299999999999997,32,258,5.6,5.99,5.95,3,4,null,11,"Kenneth Walker III","SEA",22,"RB",15,11,228,1050,9,51,74,4.5999999999999996,70,0,null,12,"D.K. Metcalf","SEA",25,"WR",17,17,141,90,0.63800000000000001,1048,11.6,6,47,54,7.4,5.3,61.6,2,null,11,"Aaron Rodgers","GNB",39,"QB",17,17,350,542,3695,8,25,2,40,7.8E-2,76,0.14799999999999999,415,0.80600000000000005]
[7.5,35,null,null,12,"Tua Tagovailoa","MIA",24,"QB",13,13,"2000-05-08",259,400,64.8,3548,25,6.3,8,2,162,84,8.9,9.1999999999999993,13.7,272.89999999999998,105.5,68.8,21,163,5,8.0399999999999991,8.3699999999999992,2,2,null,12,"Alvin Kamara","NOR",27,"RB",15,13,223,897,2,40,27,4,59.8,4,null,13,"A.J. Brown","PHI",25,"WR",17,16,145,88,0.60699999999999998,1496,17,11,59,78,10.3,5.2,88,2,null,12,"Tua Tagovailoa","MIA",24,"QB",13,13,259,400,3548,6,13,1,26,6.7000000000000004E-2,61,0.158,296,0.76700000000000002]
[8,35,null,null,13,"Russell Wilson","DEN",34,"QB",15,15,"2000-11-04",292,483,60.5,3524,16,3.3,11,2.2999999999999998,142,67,7.3,6.9,12.1,234.9,84.4,36.700000000000003,55,368,10.199999999999999,5.87,5.54,3,3,null,13,"Travis Etienne","JAX",23,"RB",17,12,220,1125,5,52,62,5.0999999999999996,66.2,5,null,14,"Ja'Marr Chase","CIN",22,"WR",12,12,134,87,0.64900000000000002,1046,12,9,58,60,7.8,7.3,87.2,2,null,13,"Russell Wilson","DEN",34,"QB",15,15,292,483,3524,19,32,1,30,6.7000000000000004E-2,70,0.156,330,0.73299999999999998]
[8.5,35,null,null,14,"Derek Carr","LVR",31,"QB",15,15,"2000-09-06",305,502,60.8,3522,24,4.8,14,2.8,161,60,7,6.7,11.5,234.8,86.3,55.5,27,191,5.0999999999999996,6.3,6.01,4,3,null,14,"Dameon Pierce","HOU",22,"RB",13,13,220,939,4,54,75,4.3,72.2,4,null,15,"T.J. Hockenson","2TM",25,"TE",17,14,129,86,0.66700000000000004,914,10.6,6,44,81,7.1,5.0999999999999996,53.8,1,null,14,"Derek Carr","LVR",31,"QB",15,15,305,502,3522,11,27,0,25,5.2999999999999999E-2,95,0.2,341,0.71799999999999997]
[9,40,null,null,15,"Daniel Jones","NYG",25,"QB",16,16,"2001-06-09",317,472,67.2,3205,15,3.2,5,1.1000000000000001,156,65,6.8,6.9,10.1,200.3,92.5,60.8,44,243,8.5,5.74,5.89,4,5,null,15,"Aaron Jones","GNB",28,"RB",17,17,213,1121,2,54,36,5.3,65.900000000000006,5,null,16,"Diontae Johnson","PIT",26,"WR",17,17,147,86,0.58499999999999996,882,10.3,0,45,37,6,5.0999999999999996,51.9,1,null,15,"Daniel Jones","NYG",25,"QB",16,16,317,472,3205,11,24,5,29,6.5000000000000002E-2,54,0.122,359,0.81]
[9.5,40,null,null,16,"Davis Mills","HOU",24,"QB",15,15,"2001-10-03",292,479,61,3118,17,3.5,15,3.1,135,58,6.5,5.8,10.7,207.9,78.8,33.1,31,244,6.1,5.64,4.9800000000000004,2,3,null,16,"Tyler Allgeier","ATL",22,"RB",16,7,210,1035,3,53,44,4.9000000000000004,64.7,0,null,17,"Christian McCaffrey","2TM",26,"RB",17,16,108,85,0.78700000000000003,741,8.6999999999999993,5,36,49,6.9,5,43.6,1,null,16,"Davis Mills","HOU",24,"QB",15,15,292,479,3118,13,12,1,18,3.9E-2,108,0.23200000000000001,329,0.70599999999999996]
[10,40,null,null,17,"Matt Ryan","IND",37,"QB",12,12,"2001-07-04",309,461,67,3057,14,3,13,2.8,156,45,6.6,6,9.9,254.8,83.9,42.9,38,287,7.6,5.55,4.9400000000000004,5,4,null,17,"Joe Mixon","CIN",26,"RB",14,14,210,814,7,47,40,3.9,58.1,0,null,18,"Christian Kirk","JAX",26,"WR",17,17,133,84,0.63200000000000001,1108,13.2,8,55,49,8.3000000000000007,4.9000000000000004,65.2,1,null,17,"Matt Ryan","IND",37,"QB",12,12,309,461,3057,12,17,1,19,4.2999999999999997E-2,60,0.13500000000000001,340,0.76700000000000002]
[10.5,40,null,null,18,"Mac Jones","NWE",24,"QB",14,14,"2000-08-06",288,442,65.2,2997,14,3.2,11,2.5,127,48,6.8,6.3,10.4,214.1,84.8,36.200000000000003,34,231,7.1,5.81,5.36,0,0,null,18,"Rhamondre Stevenson","NWE",24,"RB",17,7,210,1040,5,49,49,5,61.2,4,null,19,"Tyler Lockett","SEA",30,"WR",16,16,117,84,0.71799999999999997,1033,12.3,9,50,40,8.8000000000000007,5.3,64.599999999999994,2,null,18,"Mac Jones","NWE",24,"QB",14,14,288,442,2997,8,16,2,28,6.6000000000000003E-2,57,0.13400000000000001,318,0.75]
[11,50,null,null,19,"Andy Dalton","NOR",35,"QB",14,14,"2000-08-06",252,378,66.7,2871,18,4.8,9,2.4,135,64,7.6,7.5,11.4,205.1,95.2,50.7,25,189,6.2,6.66,6.54,1,1,null,19,"Brian Robinson Jr.","WAS",23,"RB",12,9,205,797,2,49,24,3.9,66.400000000000006,2,null,20,"Garrett Wilson","NYJ",22,"WR",17,12,147,83,0.56499999999999995,1103,13.3,4,56,60,7.5,4.9000000000000004,64.900000000000006,2,null,19,"Andy Dalton","NOR",35,"QB",14,14,252,378,2871,10,14,0,25,6.9000000000000006E-2,45,0.124,284,0.78]
[11.5,50,null,null,20,"Dak Prescott","DAL",29,"QB",12,12,"2000-04-08",261,394,66.2,2860,23,5.8,15,3.8,142,68,7.3,6.7,11,238.3,91.1,57.9,20,126,4.8,6.6,6.08,2,2,null,20,"Austin Ekeler","LAC",27,"RB",17,17,204,915,13,46,72,4.5,53.8,5,null,21,"Zay Jones","JAX",27,"WR",16,15,121,82,0.67800000000000005,823,10,5,44,59,6.8,5.0999999999999996,51.4,0,null,20,"Dak Prescott","DAL",29,"QB",12,12,261,394,2860,4,6,0,24,6.2E-2,67,0.17299999999999999,296,0.76300000000000001]
[12,50,null,null,21,"Jacoby Brissett","CLE",30,"QB",16,11,"2000-07-04",236,369,64,2608,12,3.3,6,1.6,129,55,7.1,7,11.1,163,88.9,60,24,160,6.1,6.23,6.15,2,2,null,21,"D'Onta Foreman","CAR",26,"RB",17,9,203,914,5,45,60,4.5,53.8,1,null,22,"Brandon Aiyuk","SFO",24,"WR",17,17,114,78,0.68400000000000005,1015,13,8,47,54,8.9,4.5999999999999996,59.7,1,null,21,"Jacoby Brissett","CLE",30,"QB",16,11,236,369,2608,5,16,3,25,7.0999999999999994E-2,48,0.13700000000000001,265,0.75700000000000001]
[12.5,50,null,null,22,"Ryan Tannehill","TEN",34,"QB",12,12,"2000-06-06",212,325,65.2,2536,13,4,6,1.8,116,69,7.8,7.8,12,211.3,94.6,49.1,33,238,9.1999999999999993,6.42,6.39,null,null,null,22,"David Montgomery","CHI",25,"RB",16,16,201,801,5,41,28,4,50.1,2,null,23,"Amari Cooper","CLE",28,"WR",17,17,132,78,0.59099999999999997,1160,14.9,9,61,55,8.8000000000000007,4.5999999999999996,68.2,0,null,22,"Ryan Tannehill","TEN",34,"QB",12,12,212,325,2536,11,7,1,20,6.3E-2,38,0.12,235,0.74099999999999999]
[13,50,null,null,23,"Jimmy Garoppolo","SFO",31,"QB",11,10,"2000-03-07",207,308,67.2,2437,16,5.2,4,1.3,114,57,7.9,8.4,11.8,221.5,103,54.3,18,100,5.5,7.17,7.6,1,1,null,23,"Tony Pollard","DAL",25,"RB",16,4,193,1007,9,46,57,5.2,62.9,0,null,24,"JuJu Smith-Schuster","KAN",26,"WR",16,14,101,78,0.77200000000000002,933,12,3,47,53,9.1999999999999993,4.9000000000000004,58.3,3,null,23,"Jimmy Garoppolo","SFO",31,"QB",11,10,207,308,2437,10,2,0,21,6.9000000000000006E-2,39,0.127,228,0.745]
[13.5,50,null,null,24,"Kenny Pickett","PIT",24,"QB",13,12,"2000-05-07",245,389,63,2404,7,1.8,9,2.2999999999999998,123,57,6.2,5.5,9.8000000000000007,184.9,76.7,51.5,27,182,6.5,5.34,4.7,3,4,null,24,"Jonathan Taylor","IND",23,"RB",11,11,192,861,4,39,66,4.5,78.3,3,null,25,"Mike Evans","TAM",29,"WR",15,15,127,77,0.60599999999999998,1124,14.6,6,53,63,8.9,5.0999999999999996,74.900000000000006,0,null,24,"Kenny Pickett","PIT",24,"QB",13,12,245,389,2404,8,19,1,16,4.2999999999999997E-2,67,0.182,266,0.72099999999999997]
[14,50,null,null,25,"Kyler Murray","ARI",25,"QB",11,11,"2000-08-03",259,390,66.400000000000006,2368,14,3.6,7,1.8,119,38,6.1,6,9.1,215.3,87.2,51.5,25,192,6,5.24,5.16,1,1,null,25,"Leonard Fournette","TAM",27,"RB",16,9,189,668,3,39,23,3.5,41.8,0,null,26,"Terry McLaurin","WAS",27,"WR",17,17,120,77,0.64200000000000002,1191,15.5,5,56,52,9.9,4.5,70.099999999999994,1,null,25,"Kyler Murray","ARI",25,"QB",11,11,259,390,2368,9,16,3,22,5.8999999999999997E-2,44,0.11899999999999999,289,0.77900000000000003]
[14.5,50,null,null,26,"Justin Fields","CHI",23,"QB",15,15,"2000-12-03",192,318,60.4,2242,17,5.3,11,3.5,91,56,7.1,6.6,11.7,149.5,85.2,54,55,359,14.7,5.05,4.63,1,2,null,26,"Cam Akers","LAR",23,"RB",15,9,188,786,7,39,42,4.2,52.4,2,null,27,"Cooper Kupp","LAR",29,"WR",9,9,98,75,0.76500000000000001,812,10.8,6,42,75,8.3000000000000007,8.3000000000000007,90.2,2,null,26,"Justin Fields","CHI",23,"QB",15,15,192,318,2242,12,13,0,16,5.1999999999999998E-2,59,0.193,217,0.71099999999999997]
[15,50,null,null,27,"Lamar Jackson","BAL",25,"QB",12,12,"2000-04-08",203,326,62.3,2242,17,5.2,7,2.1,105,75,6.9,7,11,186.8,91.1,59.1,26,114,7.4,6.05,6.12,1,2,null,27,"AJ Dillon","GNB",24,"RB",17,3,186,770,7,47,27,4.0999999999999996,45.3,1,null,28,"Jaylen Waddle","MIA",24,"WR",17,17,117,75,0.64100000000000001,1356,18.100000000000001,8,60,84,11.6,4.4000000000000004,79.8,1,null,27,"Lamar Jackson","BAL",25,"QB",12,12,203,326,2242,8,16,1,26,8.4000000000000005E-2,56,0.18099999999999999,233,0.754]
[15.5,50,null,null,28,"Marcus Mariota","ATL",29,"QB",13,13,"2000-08-05",184,300,61.3,2219,15,5,9,3,111,75,7.4,7,12.1,170.7,88.2,55.6,28,195,8.5,6.17,5.85,2,3,null,28,"James Conner","ARI",27,"RB",13,13,183,782,7,48,23,4.3,60.2,3,null,29,"Tee Higgins","CIN",23,"WR",16,14,109,74,0.67900000000000005,1029,13.9,7,47,59,9.4,4.5999999999999996,64.3,0,null,28,"Marcus Mariota","ATL",29,"QB",13,13,184,300,2219,3,7,4,8,2.8000000000000001E-2,65,0.22500000000000001,204,0.70599999999999996]
[16,50,null,null,29,"Baker Mayfield","2TM",27,null,12,10,"2000-08-02",201,335,60,2163,10,3,8,2.4,94,75,6.5,6,10.8,180.3,79,24.5,36,217,9.6999999999999993,5.25,4.8099999999999996,1,1,null,29,"Raheem Mostert","MIA",30,"RB",16,14,181,891,3,44,67,4.9000000000000004,55.7,1,null,"Rk","Player","Tm","Age","Pos","G","GS","Tgt","Rec","Ctch%","Yds","Y/R","TD","1D","Lng","Y/Tgt","R/G","Y/G","Fmb",null,29,"Baker Mayfield","2TM",27,null,12,10,201,335,2163,16,15,1,17,5.2999999999999999E-2,60,0.188,226,0.70799999999999996]
[16.5,50,null,null,"Rk","Player","Tm","Age","Pos","G","GS","QBrec","Cmp","Att","Cmp%","Yds","TD","TD%","Int","Int%","1D","Lng","Y/A","AY/A","Y/C","Y/G","Rate","QBR","Sk","Yds","Sk%","NY/A","ANY/A","4QC","GWD",null,"Rk","Player","Tm","Age","Pos","G","GS","Att","Yds","TD","1D","Lng","Y/A","Y/G","Fmb",null,30,"Mark Andrews","BAL",27,"TE",15,15,113,73,0.64600000000000002,847,11.6,5,48,36,7.5,4.9000000000000004,56.5,1,null,30,"Matthew Stafford","LAR",34,"QB",9,9,206,303,2087,3,6,1,11,3.6999999999999998E-2,54,0.182,224,0.75700000000000001]
[17,50,null,null,30,"Matthew Stafford","LAR",34,"QB",9,9,"2000-06-03",206,303,68,2087,10,3.3,8,2.6,105,75,6.9,6.4,10.1,231.9,87.4,50.3,29,208,8.6999999999999993,5.66,5.18,null,null,null,30,"Devin Singletary","BUF",25,"RB",16,16,177,819,5,43,33,4.5999999999999996,51.2,3,null,31,"Evan Engram","JAX",28,"TE",17,14,98,73,0.745,766,10.5,4,33,36,7.8,4.3,45.1,0,null,31,"Taylor Heinicke","WAS",29,"QB",9,9,161,259,1859,7,14,2,6,2.5000000000000001E-2,44,0.18099999999999999,177,0.72799999999999998]
[null,null,null,null,31,"Taylor Heinicke","WAS",29,"QB",9,9,"2001-03-05",161,259,62.2,1859,12,4.5999999999999996,6,2.2999999999999998,93,61,7.2,7.1,11.5,206.6,89.6,44.4,19,141,6.8,6.18,6.07,2,1,null,31,"Jeff Wilson","2TM",27,"RB",16,7,176,860,5,43,41,4.9000000000000004,53.8,3,null,32,"Leonard Fournette","TAM",27,"RB",16,9,83,73,0.88,523,7.2,3,26,44,6.3,4.5999999999999996,32.700000000000003,0,null,32,"Carson Wentz","WAS",30,"QB",8,7,172,276,1755,8,6,0,16,5.8999999999999997E-2,54,0.2,192,0.71099999999999997]
[null,null,null,null,32,"Carson Wentz","WAS",30,"QB",8,7,"2000-05-02",172,276,62.3,1755,11,4,9,3.3,85,75,6.4,5.7,10.199999999999999,219.4,80.2,32.9,26,159,8.6,5.28,4.67,2,2,null,32,"Latavius Murray","2TM",32,"RB",13,7,171,760,6,44,52,4.4000000000000004,58.5,1,null,33,"Tyler Higbee","LAR",29,"TE",17,17,108,72,0.66700000000000004,620,8.6,3,32,26,5.7,4.2,36.5,0,null,33,"Zach Wilson","NYJ",23,"QB",9,9,132,242,1688,5,20,0,11,0.05,56,0.252,149,0.67100000000000004]
[null,null,null,null,33,"Zach Wilson","NYJ",23,"QB",9,9,"2000-04-05",132,242,54.5,1688,6,2.5,7,2.9,73,79,7,6.2,12.8,187.6,72.8,36.5,23,175,8.6999999999999993,5.71,4.97,1,2,null,33,"Isiah Pacheco","KAN",23,"RB",17,11,170,830,5,37,31,4.9000000000000004,48.8,4,null,34,"Drake London","ATL",21,"WR",17,15,117,72,0.61499999999999999,866,12,4,48,40,7.4,4.2,50.9,3,null,34,"Brock Purdy","SFO",23,"QB",9,5,114,170,1374,7,5,0,13,7.9000000000000001E-2,20,0.121,127,0.77]
[null,null,null,null,34,"Brock Purdy","SFO",23,"QB",9,5,"5-0-0",114,170,67.099999999999994,1374,13,7.6,4,2.4,66,54,8.1,8.6,12.1,152.69999999999999,107.3,65.599999999999994,11,84,6.1,7.13,7.57,1,1,null,34,"Jalen Hurts","PHI",24,"QB",15,15,165,760,13,67,42,4.5999999999999996,50.7,9,null,35,"Chris Olave","NOR",22,"WR",15,9,119,72,0.60499999999999998,1042,14.5,4,48,53,8.8000000000000007,4.8,69.5,2,null,35,"Mitchell Trubisky","PIT",28,"QB",7,5,117,180,1252,4,2,1,7,0.04,25,0.14099999999999999,130,0.73399999999999999]
[null,null,null,null,35,"Mitchell Trubisky","PIT",28,"QB",7,5,"2000-03-02",117,180,65,1252,4,2.2000000000000002,5,2.8,65,45,7,6.2,10.7,178.9,81.099999999999994,56.4,11,68,5.8,6.2,5.44,0,1,null,35,"Justin Fields","CHI",23,"QB",15,15,160,1143,8,65,67,7.1,76.2,16,null,36,"Josh Palmer","LAC",24,"WR",16,11,107,72,0.67300000000000004,769,10.7,3,39,50,7.2,4.5,48.1,1,null,36,"Mike White","NYJ",27,"QB",4,4,103,175,1192,6,6,0,3,1.7999999999999999E-2,38,0.22500000000000001,113,0.66900000000000004]
[null,null,null,null,36,"Mike White","NYJ",27,"QB",4,4,"2000-03-01",103,175,58.9,1192,3,1.7,4,2.2999999999999998,56,60,6.8,6.1,11.6,298,75.7,37,9,76,4.9000000000000004,6.07,5.41,null,null,null,36,"Antonio Gibson","WAS",24,"RB",15,6,149,546,3,32,20,3.7,36.4,1,null,37,"Adam Thielen","MIN",32,"WR",17,17,107,70,0.65400000000000003,716,10.199999999999999,6,45,36,6.7,4.0999999999999996,42.1,0,null,37,"Sam Darnold","CAR",25,"QB",6,6,82,140,1143,3,19,3,7,5.8999999999999997E-2,16,0.13600000000000001,91,0.77100000000000002]
[null,null,null,null,37,"Sam Darnold","CAR",25,"QB",6,6,"2000-02-04",82,140,58.6,1143,7,5,3,2.1,57,52,8.1999999999999993,8.1999999999999993,13.9,190.5,92.6,48.5,10,78,6.7,7.1,7.13,0,1,null,37,"Cordarrelle Patterson","ATL",31,"RB",13,11,144,695,8,39,40,4.8,53.5,1,null,38,"Rhamondre Stevenson","NWE",24,"RB",17,7,88,69,0.78400000000000003,421,6.1,1,13,40,4.8,4.0999999999999996,24.8,4,null,38,"Deshaun Watson","CLE",27,"QB",6,6,99,170,1102,4,12,2,12,7.6999999999999999E-2,22,0.14099999999999999,116,0.74399999999999999]
[null,null,null,null,38,"Deshaun Watson","CLE",27,"QB",6,6,"2000-03-03",99,170,58.2,1102,7,4.0999999999999996,5,2.9,53,46,6.5,6,11.1,183.7,79.099999999999994,38.299999999999997,20,106,10.5,5.24,4.79,null,null,null,38,"Khalil Herbert","CHI",24,"RB",13,1,129,731,4,26,63,5.7,56.2,0,null,39,"Marquise Brown","ARI",25,"WR",12,10,107,67,0.626,709,10.6,3,33,47,6.6,5.6,59.1,1,null,39,"Joe Flacco","NYJ",37,"QB",5,4,110,191,1051,5,6,0,13,7.0000000000000007E-2,38,0.20499999999999999,127,0.68600000000000005]
[null,null,null,null,39,"Joe Flacco","NYJ",37,"QB",5,4,"2000-03-01",110,191,57.6,1051,5,2.6,3,1.6,55,66,5.5,5.3,9.6,210.2,75.2,34.1,10,66,5,4.9000000000000004,4.7300000000000004,1,1,null,39,"Rachaad White","TAM",23,"RB",17,8,129,481,1,27,35,3.7,28.3,3,null,40,"Jerry Jeudy","DEN",23,"WR",15,14,100,67,0.67,972,14.5,6,41,67,9.6999999999999993,4.5,64.8,0,null,40,"Cooper Rush","DAL",29,"QB",9,5,94,162,1051,8,2,1,9,5.7000000000000002E-2,33,0.20799999999999999,106,0.66700000000000004]
[null,null,null,null,40,"Cooper Rush","DAL",29,"QB",9,5,"2000-01-04",94,162,58,1051,5,3.1,3,1.9,52,46,6.5,6.3,11.2,116.8,80,58.7,7,49,4.0999999999999996,5.93,5.72,0,2,null,40,"Josh Allen","BUF",26,"QB",16,16,124,762,7,55,44,6.1,47.6,13,null,41,"Jakobi Meyers","NWE",26,"WR",14,13,96,67,0.69799999999999995,804,12,6,38,48,8.4,4.8,57.4,2,null,41,"Jameis Winston","NOR",28,"QB",3,3,73,115,858,2,2,2,3,2.7E-2,23,0.20699999999999999,81,0.73]
[null,null,null,null,41,"Jameis Winston","NOR",28,"QB",3,3,"2000-02-01",73,115,63.5,858,4,3.5,5,4.3,35,51,7.5,6.2,11.8,286,79.5,32.799999999999997,11,74,8.6999999999999993,6.22,5.07,1,1,null,41,"Kareem Hunt","CLE",27,"RB",17,0,123,468,3,30,24,3.8,27.5,1,null,42,"Keenan Allen","LAC",30,"WR",10,10,89,66,0.74199999999999999,752,11.4,4,39,46,8.4,6.6,75.2,1,null,42,"Bailey Zappe","NWE",23,"QB",4,2,65,92,781,5,4,0,3,3.4000000000000002E-2,11,0.125,69,0.78400000000000003]
[null,null,null,null,42,"Bailey Zappe","NWE",23,"QB",4,2,"2-0-0",65,92,70.7,781,5,5.4,3,3.3,37,53,8.5,8.1,12,195.3,100.9,34.5,6,40,6.1,7.56,7.2,null,null,null,42,"Daniel Jones","NYG",25,"QB",16,16,120,708,7,57,25,5.9,44.3,6,null,43,"DeAndre Hopkins","ARI",30,"WR",9,9,96,64,0.66700000000000004,717,11.2,3,35,33,7.5,7.1,79.7,2,null,43,"Colt McCoy","ARI",36,"QB",4,3,90,132,780,2,3,0,11,8.5000000000000006E-2,22,0.17100000000000001,102,0.79100000000000004]
[null,null,null,null,43,"Colt McCoy","ARI",36,"QB",4,3,"2000-02-01",90,132,68.2,780,1,0.8,3,2.2999999999999998,34,47,5.9,5,8.6999999999999993,195,76.599999999999994,37.4,13,97,9,4.71,3.92,null,null,null,43,"Michael Carter","NYJ",23,"RB",16,10,114,402,3,14,25,3.5,25.1,2,null,44,"Curtis Samuel","WAS",26,"WR",17,12,92,64,0.69599999999999995,656,10.3,4,36,49,7.1,3.8,38.6,1,null,44,"P.J. Walker","CAR",27,"QB",6,5,63,106,731,1,1,0,7,6.7000000000000004E-2,21,0.2,69,0.65700000000000003]
[null,null,null,null,44,"P.J. Walker","CAR",27,"QB",6,5,"2000-03-02",63,106,59.4,731,3,2.8,3,2.8,30,62,6.9,6.2,11.6,121.8,78,23.5,7,46,6.2,6.06,5.4,null,null,null,44,"Lamar Jackson","BAL",25,"QB",12,12,112,764,3,47,79,6.8,63.7,5,null,45,"Courtland Sutton","DEN",27,"WR",15,15,109,64,0.58699999999999997,829,13,2,38,51,7.6,4.3,55.3,0,null,45,"Desmond Ridder","ATL",23,"QB",4,4,73,115,708,1,5,0,1,8.9999999999999993E-3,20,0.182,83,0.755]
[null,null,null,null,45,"Desmond Ridder","ATL",23,"QB",4,4,"2000-02-02",73,115,63.5,708,2,1.7,0,0,37,40,6.2,6.5,9.6999999999999993,177,86.4,49.8,9,33,7.3,5.44,5.77,1,1,null,45,"James Robinson","2TM",24,"RB",11,5,110,425,3,22,50,3.9,38.6,1,null,46,"Parris Campbell","IND",25,"WR",17,16,91,63,0.69199999999999995,623,9.9,3,32,49,6.8,3.7,36.6,1,null,46,"Teddy Bridgewater","MIA",30,"QB",5,2,49,79,683,1,4,0,2,2.7E-2,16,0.21299999999999999,56,0.747]
[null,null,null,null,46,"Teddy Bridgewater","MIA",30,"QB",5,2,"0-2-0",49,79,62,683,4,5.0999999999999996,4,5.0999999999999996,32,64,8.6,7.4,13.9,136.6,85.6,47.4,7,45,8.1,7.42,6.26,null,null,null,46,"Kenyan Drake","BAL",28,"RB",12,5,109,482,4,21,40,4.4000000000000004,40.200000000000003,1,null,47,"Pat Freiermuth","PIT",24,"TE",16,8,98,63,0.64300000000000002,732,11.6,2,37,57,7.5,3.9,45.8,0,null,47,"Gardner Minshew II","PHI",26,"QB",5,2,44,76,663,2,5,1,2,2.9000000000000001E-2,14,0.2,51,0.72899999999999998]
[null,null,null,null,47,"Gardner Minshew II","PHI",26,"QB",5,2,"0-2-0",44,76,57.9,663,3,3.9,3,3.9,30,78,8.6999999999999993,7.7,15.1,132.6,83.4,39.700000000000003,6,28,7.3,7.74,6.83,null,null,null,47,"Damien Harris","NWE",25,"RB",11,9,106,462,3,23,30,4.4000000000000004,42,0,null,48,"D.J. Moore","CAR",25,"WR",17,17,118,63,0.53400000000000003,888,14.1,7,44,62,7.5,3.7,52.2,0,null,48,"Tyler Huntley","BAL",24,"QB",6,4,75,112,658,0,4,2,3,2.8000000000000001E-2,15,0.14199999999999999,83,0.78300000000000003]
[null,null,null,null,48,"Tyler Huntley","BAL",24,"QB",6,4,"2000-02-02",75,112,67,658,2,1.8,3,2.7,31,40,5.9,5,8.8000000000000007,109.7,77.2,41.3,7,34,5.9,5.24,4.45,1,1,null,48,"D'Andre Swift","DET",23,"RB",14,8,99,542,5,21,50,5.5,38.700000000000003,1,null,49,"Mike Williams","LAC",28,"WR",13,13,93,63,0.67700000000000005,895,14.2,4,39,55,9.6,4.8,68.8,0,null,49,"Jarrett Stidham","LVR",26,"QB",5,2,53,83,656,2,4,0,5,6.3E-2,13,0.16500000000000001,59,0.747]
[null,null,null,null,49,"Jarrett Stidham","LVR",26,"QB",5,2,"0-2-0",53,83,63.9,656,4,4.8,3,3.6,32,60,7.9,7.2,12.4,131.19999999999999,89.2,57.8,7,47,7.8,6.77,6.16,null,null,null,49,"Taysom Hill","NOR",32,"TE",16,8,96,575,7,34,60,6,35.9,2,null,50,"Donovan Peoples-Jones","CLE",23,"WR",17,14,96,61,0.63500000000000001,839,13.8,3,33,42,8.6999999999999993,3.6,49.4,1,null,50,"Sam Ehlinger","IND",24,"QB",4,3,64,101,573,2,1,0,6,0.06,18,0.18,74,0.74]
[null,null,null,null,50,"Sam Ehlinger","IND",24,"QB",4,3,"0-3-0",64,101,63.4,573,3,3,3,3,28,47,5.7,4.9000000000000004,9,143.30000000000001,76.099999999999994,31.9,14,87,12.2,4.2300000000000004,3.57,null,null,null,50,"Chuba Hubbard","CAR",23,"RB",15,2,95,466,2,23,35,4.9000000000000004,31.1,2,null,51,"George Kittle","SFO",29,"TE",15,15,86,60,0.69799999999999995,765,12.8,11,36,54,8.9,4,51,1,null,51,"Skylar Thompson","MIA",25,"QB",7,2,60,105,534,2,4,0,8,7.9000000000000001E-2,22,0.218,70,0.69299999999999995]
[null,null,null,null,51,"Skylar Thompson","MIA",25,"QB",7,2,"2000-01-01",60,105,57.1,534,1,1,3,2.9,26,32,5.0999999999999996,4,8.9,76.3,62.2,27.2,6,40,5.4,4.45,3.41,0,1,null,51,"Samaje Perine","CIN",27,"RB",16,2,95,394,2,19,29,4.0999999999999996,24.6,0,null,52,"Allen Lazard","GNB",27,"WR",15,15,100,60,0.6,788,13.1,6,45,47,7.9,4,52.5,0,null,52,"Brett Rypien","DEN",26,"QB",4,2,53,88,483,2,1,0,2,2.3E-2,19,0.218,63,0.72399999999999998]
[null,null,null,null,52,"Brett Rypien","DEN",26,"QB",4,2,"2000-01-01",53,88,60.2,483,2,2.2999999999999998,4,4.5,24,45,5.5,3.9,9.1,120.8,63.8,24.3,8,47,8.3000000000000007,4.54,3.08,null,null,null,52,"Zack Moss","2TM",25,"RB",13,3,93,456,1,18,43,4.9000000000000004,35.1,1,null,53,"Joe Mixon","CIN",26,"RB",14,14,75,60,0.8,441,7.4,2,17,35,5.9,4.3,31.5,0,null,53,"Kyle Allen","HOU",26,"QB",2,2,46,78,416,4,3,0,4,5.2999999999999999E-2,14,0.187,52,0.69299999999999995]
[null,null,null,null,53,"Kyle Allen","HOU",26,"QB",2,2,"0-2-0",46,78,59,416,2,2.6,4,5.0999999999999996,19,39,5.3,3.5,9,208,60.6,3.4,5,41,6,4.5199999999999996,2.83,null,null,null,53,"J.K. Dobbins","BAL",24,"RB",8,8,92,520,2,26,44,5.7,65,0,null,54,"K.J. Osborn","MIN",25,"WR",17,9,90,60,0.66700000000000004,650,10.8,5,32,66,7.2,3.5,38.200000000000003,1,null,54,"Trace McSorley","ARI",27,"QB",6,1,45,83,412,1,5,1,2,2.5999999999999999E-2,21,0.27300000000000002,50,0.64900000000000002]
[null,null,null,null,54,"Trace McSorley","ARI",27,"QB",6,1,"0-1-0",45,83,54.2,412,0,0,5,6,17,47,5,2.2999999999999998,9.1999999999999993,68.7,42.8,10.8,3,27,3.5,4.4800000000000004,1.86,null,null,null,54,"Melvin Gordon","DEN",29,"RB",10,6,90,318,2,15,17,3.5,31.8,5,null,55,"Aaron Jones","GNB",28,"RB",17,17,72,59,0.81899999999999995,395,6.7,5,19,30,5.5,3.5,23.2,5,null,55,"Joshua Dobbs","TEN",27,"QB",2,2,40,68,411,2,3,0,3,4.5999999999999999E-2,14,0.215,43,0.66200000000000003]
[null,null,null,null,55,"Joshua Dobbs","TEN",27,"QB",2,2,"0-2-0",40,68,58.8,411,2,2.9,2,2.9,25,39,6,5.3,10.3,205.5,73.8,50.8,6,26,8.1,5.2,4.53,null,null,null,55,"James Cook","BUF",23,"RB",16,0,89,507,2,25,33,5.7,31.7,1,null,56,"Tyler Boyd","CIN",28,"WR",16,14,82,58,0.70699999999999996,762,13.1,5,42,60,9.3000000000000007,3.6,47.6,0,null,56,"David Blough","ARI",27,"QB",2,2,38,58,402,0,2,0,2,3.5999999999999997E-2,10,0.17899999999999999,43,0.76800000000000002]
[null,null,null,null,56,"David Blough","ARI",27,"QB",2,2,"0-2-0",38,58,65.5,402,2,3.4,2,3.4,18,77,6.9,6.1,10.6,201,82.7,28.2,5,24,7.9,6,5.21,null,null,null,56,"Gus Edwards","BAL",27,"RB",9,4,87,433,3,30,37,5,48.1,1,null,57,"Tyler Conklin","NYJ",27,"TE",17,16,87,58,0.66700000000000004,552,9.5,3,25,30,6.3,3.4,32.5,2,null,57,"John Wolford","LAR",27,"QB",3,3,38,62,390,2,1,0,1,1.6E-2,10,0.16400000000000001,50,0.82]
[null,null,null,null,57,"John Wolford","LAR",27,"QB",3,3,"2000-02-01",38,62,61.3,390,1,1.6,3,4.8,19,30,6.3,4.4000000000000004,10.3,130,64.599999999999994,22.7,7,49,10.1,4.9400000000000004,3.28,null,null,null,57,"Zonovan Knight","NYJ",21,"RB",7,4,85,300,1,14,48,3.5,42.9,2,null,58,"Gerald Everett","LAC",28,"TE",16,11,87,58,0.66700000000000004,555,9.6,4,29,26,6.4,3.6,34.700000000000003,0,null,58,"Anthony Brown","BAL",24,"QB",2,1,22,49,302,2,1,2,3,6.5000000000000002E-2,12,0.26100000000000001,28,0.60899999999999999]
[null,null,null,null,58,"Anthony Brown","BAL",24,"QB",2,1,"0-1-0",22,49,44.9,302,0,0,2,4.0999999999999996,13,47,6.2,4.3,13.7,151,48.2,null,5,14,9.3000000000000007,5.33,3.67,null,null,null,58,"Marcus Mariota","ATL",29,"QB",13,13,85,438,4,30,30,5.2,33.700000000000003,8,null,59,"David Njoku","CLE",26,"TE",14,14,80,58,0.72499999999999998,628,10.8,4,36,38,7.9,4.0999999999999996,44.9,1,null,59,"Malik Willis","TEN",23,"QB",8,3,31,61,276,2,7,0,4,7.3999999999999996E-2,12,0.222,36,0.66700000000000004]
[null,null,null,null,59,"Malik Willis","TEN",23,"QB",8,3,"2000-02-01",31,61,50.8,276,0,0,3,4.9000000000000004,11,48,4.5,2.2999999999999998,8.9,34.5,42.8,12.4,10,49,14.1,3.2,1.3,null,null,null,59,"Breece Hall","NYJ",21,"RB",7,2,80,463,4,20,62,5.8,66.099999999999994,1,null,"Rk","Player","Tm","Age","Pos","G","GS","Tgt","Rec","Ctch%","Yds","Y/R","TD","1D","Lng","Y/Tgt","R/G","Y/G","Fmb",null,60,"Taysom Hill","NOR",32,"TE",16,8,13,19,240,0,1,0,1,5.6000000000000001E-2,2,0.111,14,0.77800000000000002]
[null,null,null,null,"Rk","Player","Tm","Age","Pos","G","GS","QBrec","Cmp","Att","Cmp%","Yds","TD","TD%","Int","Int%","1D","Lng","Y/A","AY/A","Y/C","Y/G","Rate","QBR","Sk","Yds","Sk%","NY/A","ANY/A","4QC","GWD",null,"Rk","Player","Tm","Age","Pos","G","GS","Att","Yds","TD","1D","Lng","Y/A","Y/G","Fmb",null,60,"Saquon Barkley","NYG",25,"RB",16,16,76,57,0.75,338,5.9,0,10,41,4.4000000000000004,3.6,21.1,1,null,61,"Nick Foles","IND",33,"QB",3,2,25,42,224,0,1,0,2,4.9000000000000002E-2,9,0.22,27,0.65900000000000003]
[null,null,null,null,60,"Taysom Hill","NOR",32,"TE",16,8,null,13,19,68.400000000000006,240,2,10.5,0,0,11,68,12.6,14.7,18.5,15,146.30000000000001,78.3,2,14,9.5,10.76,12.67,null,null,null,60,"Eno Benjamin","3TM",23,null,15,3,77,313,2,14,45,4.0999999999999996,20.9,0,null,61,"Brandin Cooks","HOU",29,"WR",13,13,93,57,0.61299999999999999,699,12.3,3,29,44,7.5,4.4000000000000004,53.8,0,null,62,"Nick Mullens","MIN",27,"QB",4,0,21,25,224,0,0,0,0,0,2,0.08,23,0.92]
[null,null,null,null,61,"Nick Foles","IND",33,"QB",3,2,"0-2-0",25,42,59.5,224,0,0,4,9.5,9,49,5.3,1,9,74.7,34.299999999999997,7.4,8,48,16,3.52,-0.08,null,null,null,61,"Jaylen Warren","PIT",24,"RB",16,0,77,379,1,20,31,4.9000000000000004,23.7,1,null,62,"Mack Hollins","LVR",29,"WR",17,16,94,57,0.60599999999999998,690,12.1,4,34,60,7.3,3.4,40.6,0,null,63,"Jordan Love","GNB",24,"QB",4,0,14,21,195,0,0,1,1,0.05,3,0.15,16,0.8]
[null,null,null,null,62,"Nick Mullens","MIN",27,"QB",4,0,null,21,25,84,224,1,4,1,4,11,37,9,8,10.7,56,100.7,56.1,0,0,0,8.9600000000000009,7.96,null,null,null,62,"Caleb Huntley","ATL",24,"RB",12,0,76,366,1,18,30,4.8,30.5,1,null,63,"Richie James","NYG",27,"WR",17,4,70,57,0.81399999999999995,569,10,4,29,33,8.1,3.4,33.5,3,null,64,"Trey Lance","SFO",22,"QB",2,2,15,31,194,0,1,0,3,0.1,10,0.33300000000000002,19,0.63300000000000001]
[null,null,null,null,63,"Jordan Love","GNB",24,"QB",4,0,null,14,21,66.7,195,1,4.8,0,0,9,63,9.3000000000000007,10.199999999999999,13.9,48.8,112.2,82,0,0,0,9.2899999999999991,10.24,null,null,null,63,"Joe Burrow","CIN",26,"QB",16,16,75,257,5,28,23,3.4,16.100000000000001,6,null,64,"Alvin Kamara","NOR",27,"RB",15,13,77,57,0.74,490,8.6,2,17,54,6.4,3.8,32.700000000000003,4,null,65,"Trevor Siemian","CHI",31,"QB",2,1,15,26,184,0,1,0,0,0,5,0.2,15,0.6]
[null,null,null,null,64,"Trey Lance","SFO",22,"QB",2,2,"2000-01-01",15,31,48.4,194,0,0,1,3.2,6,44,6.3,4.8,12.9,97,55,34.9,2,9,6.1,5.61,4.24,null,null,null,64,"Alexander Mattison","MIN",24,"RB",17,0,74,283,5,21,15,3.8,16.600000000000001,0,null,65,"Dalton Schultz","DAL",26,"TE",15,15,89,57,0.64,577,10.1,5,27,30,6.5,3.8,38.5,1,null,66,"Sam Howell","WAS",22,"QB",1,1,11,19,169,1,1,0,2,0.111,3,0.16700000000000001,13,0.72199999999999998]
[null,null,null,null,65,"Trevor Siemian","CHI",31,"QB",2,1,"0-1-0",15,26,57.7,184,1,3.8,1,3.8,7,33,7.1,6.1,12.3,92,76.400000000000006,26.5,2,14,7.1,6.07,5.18,null,null,null,65,"Jerick McKinnon","KAN",30,"RB",17,0,72,291,1,12,30,4,17.100000000000001,1,null,66,"Jerick McKinnon","KAN",30,"RB",17,0,71,56,0.78900000000000003,512,9.1,9,28,56,7.2,3.3,30.1,1,null,67,"Davis Webb","NYG",27,"QB",1,1,23,40,168,2,2,0,0,0,7,0.184,23,0.60499999999999998]
[null,null,null,null,66,"Sam Howell","WAS",22,"QB",1,1,"1-0-0",11,19,57.9,169,1,5.3,1,5.3,6,52,8.9,7.6,15.4,169,83,46.4,3,11,13.6,7.18,6.05,null,null,null,66,"Clyde Edwards-Helaire","KAN",23,"RB",10,6,71,302,3,15,52,4.3,30.2,0,null,67,"Deebo Samuel","SFO",26,"WR",13,12,94,56,0.59599999999999997,632,11.3,2,25,57,6.7,4.3,48.6,3,null,68,"Bryce Perkins","LAR",26,"QB",5,1,19,34,161,5,0,1,1,0.03,4,0.121,21,0.63600000000000001]
[null,null,null,null,67,"Davis Webb","NYG",27,"QB",1,1,"0-1-0",23,40,57.5,168,1,2.5,0,0,11,25,4.2,4.7,7.3,168,75.8,73.5,0,0,0,4.2,4.7,null,null,null,67,"Darrell Henderson","LAR",25,"RB",10,7,70,283,3,14,23,4,28.3,0,null,68,"Dallas Goedert","PHI",27,"TE",12,12,69,55,0.79700000000000004,702,12.8,3,40,31,10.199999999999999,4.5999999999999996,58.5,1,null,69,"Nathan Peterman","CHI",28,"QB",3,1,14,25,139,0,0,1,2,8.3000000000000004E-2,5,0.20799999999999999,17,0.70799999999999996]
[null,null,null,null,68,"Bryce Perkins","LAR",26,"QB",5,1,"0-1-0",19,34,55.9,161,1,2.9,2,5.9,10,20,4.7,2.7,8.5,32.200000000000003,53.7,27.2,6,50,15,2.78,1.03,null,null,null,68,"Joshua Kelley","LAC",25,"RB",13,1,69,287,2,16,22,4.2,22.1,0,null,69,"Josh Jacobs","LVR",24,"RB",17,17,64,53,0.82799999999999996,400,7.5,0,16,43,6.3,3.1,23.5,3,null,70,"Jeff Driskel","HOU",29,"QB",7,2,14,20,108,3,1,0,1,5.2999999999999999E-2,0,0,15,0.78900000000000003]
[null,null,null,null,69,"Nathan Peterman","CHI",28,"QB",3,1,"0-1-0",14,25,56,139,1,4,1,4,9,28,5.6,4.5999999999999996,9.9,46.3,68.599999999999994,39.9,1,6,3.8,5.12,4.1500000000000004,null,null,null,69,"Chase Edmonds","2TM",26,"RB",13,3,68,245,2,8,28,3.6,18.8,0,null,70,"Robert Tonyan","GNB",28,"TE",17,3,67,53,0.79100000000000004,470,8.9,2,20,24,7,3.1,27.6,0,null,71,"Chris Streveler","NYJ",27,"QB",2,1,10,15,90,0,0,0,1,6.7000000000000004E-2,2,0.13300000000000001,10,0.66700000000000004]
[null,null,null,null,70,"Jeff Driskel","HOU",29,"QB",7,2,"0-1-0",14,20,70,108,1,5,0,0,5,28,5.4,6.4,7.7,15.4,99.6,19.600000000000001,2,13,9.1,4.32,5.23,null,null,null,70,"Deon Jackson","IND",23,"RB",16,2,68,236,1,13,17,3.5,14.8,1,null,71,"Robert Woods","TEN",30,"WR",17,15,91,53,0.58199999999999996,527,9.9,2,31,41,5.8,3.1,31,1,null,72,"Jacob Eason","CAR",25,"QB",1,0,3,5,59,0,0,0,0,0,1,0.2,4,0.8]
[null,null,null,null,71,"Chris Streveler","NYJ",27,"QB",2,1,null,10,15,66.7,90,0,0,0,0,5,30,6,6,9,45,82.6,72.3,0,0,0,6,6,null,null,null,71,"Geno Smith","SEA",32,"QB",17,17,68,366,1,24,25,5.4,21.5,8,null,72,"Greg Dortch","ARI",24,"WR",16,4,64,52,0.81299999999999994,467,9,2,19,47,7.3,3.3,29.2,1,null,73,"Tyrod Taylor","NYG",33,"QB",3,0,6,8,58,0,0,0,1,0.125,0,0,7,0.875]
[null,null,null,null,72,"Jacob Eason","CAR",25,"QB",1,0,null,3,5,60,59,0,0,1,20,2,49,11.8,2.8,19.7,59,61.7,0.8,0,0,0,11.8,2.8,null,null,null,72,"Kyler Murray","ARI",25,"QB",11,11,67,418,3,23,42,6.2,38,8,null,73,"Hayden Hurst","CIN",29,"TE",13,13,68,52,0.76500000000000001,414,8,2,26,29,6.1,4,31.8,0,null,74,"Chase Daniel","LAC",36,"QB",4,0,8,12,52,0,0,0,1,8.3000000000000004E-2,3,0.25,9,0.75]
[null,null,null,null,73,"Tyrod Taylor","NYG",33,"QB",3,0,null,6,8,75,58,1,12.5,1,12.5,3,19,7.3,4.0999999999999996,9.6999999999999993,19.3,94.8,10.7,3,18,27.3,3.64,1.36,null,null,null,73,"Mark Ingram","NOR",33,"RB",10,3,62,233,1,12,14,3.8,23.3,2,null,74,"George Pickens","PIT",21,"WR",17,12,84,52,0.61899999999999999,801,15.4,4,38,42,9.5,3.1,47.1,0,null,75,"Brian Hoyer","NWE",37,"QB",1,1,5,6,37,0,0,0,0,0,1,0.16700000000000001,5,0.83299999999999996]
[null,null,null,null,74,"Chase Daniel","LAC",36,"QB",4,0,null,8,12,66.7,52,1,8.3000000000000007,0,0,4,13,4.3,6,6.5,13,103.5,57.9,1,1,7.7,3.92,5.46,null,null,null,74,"Trevor Lawrence","JAX",23,"QB",17,17,62,291,5,27,24,4.7,17.100000000000001,12,null,75,"Russell Gage","TAM",26,"WR",13,4,70,51,0.72899999999999998,426,8.4,5,31,23,6.1,3.9,32.799999999999997,1,null,76,"C.J. Beathard","JAX",29,"QB",4,0,7,11,35,0,0,0,1,9.0999999999999998E-2,2,0.182,8,0.72699999999999998]
[null,null,null,null,75,"Brian Hoyer","NWE",37,"QB",1,1,"0-1-0",5,6,83.3,37,0,0,0,0,2,27,6.2,6.2,7.4,37,92.4,26.7,1,8,14.3,4.1399999999999997,4.1399999999999997,null,null,null,75,"Patrick Mahomes","KAN",27,"QB",17,17,61,358,4,25,20,5.9,21.1,5,null,76,"Noah Fant","SEA",25,"TE",17,16,63,50,0.79400000000000004,486,9.6999999999999993,4,24,51,7.7,2.9,28.6,0,null,77,"Justin Jefferson","MIN",23,"WR",17,17,2,2,34,0,0,0,0,0,0,0,2,1]
[null,null,null,null,76,"C.J. Beathard","JAX",29,"QB",4,0,null,7,11,63.6,35,0,0,1,9.1,2,11,3.2,-0.9,5,8.8000000000000007,30.5,21.4,1,5,8.3000000000000007,2.5,-1.25,null,null,null,76,"Rashaad Penny","SEA",26,"RB",5,5,57,346,2,15,41,6.1,69.2,1,null,77,"Cole Kmet","CHI",23,"TE",17,17,69,50,0.72499999999999998,544,10.9,7,27,50,7.9,2.9,32,1,null,78,"Christian McCaffrey","2TM",26,"RB",17,16,1,1,34,0,0,0,0,0,0,0,1,1]
[null,null,null,null,77,"Justin Jefferson","MIN",23,"WR",17,17,null,2,2,100,34,0,0,0,0,2,23,17,17,17,2,118.7,94.8,0,0,0,17,17,null,null,null,77,"Kenny Pickett","PIT",24,"QB",13,12,55,237,3,23,23,4.3,18.2,4,null,78,"Rachaad White","TAM",23,"RB",17,8,58,50,0.86199999999999999,290,5.8,2,13,20,5,2.9,17.100000000000001,3,null,79,"Tim Boyle","CHI",28,"QB",1,0,2,8,33,0,0,0,0,0,3,0.375,5,0.625]
[null,null,null,null,78,"Christian McCaffrey","2TM",26,"RB",17,16,null,1,1,100,34,1,100,0,0,1,34,34,54,34,2,158.30000000000001,100,0,0,0,34,54,null,null,null,78,"Russell Wilson","DEN",34,"QB",15,15,55,277,3,21,19,5,18.5,6,null,79,"Gabriel Davis","BUF",23,"WR",15,15,93,48,0.51600000000000001,836,17.399999999999999,7,35,98,9,3.2,55.7,1,null,80,"Blaine Gabbert","TAM",33,"QB",1,0,6,8,29,0,0,0,1,0.125,0,0,8,1]
[null,null,null,null,79,"Tim Boyle","CHI",28,"QB",1,0,null,2,8,25,33,0,0,2,25,2,17,4.0999999999999996,-7.1,16.5,33,4.7,0.5,0,0,0,4.13,-7.13,null,null,null,79,"Matt Breida","NYG",27,"RB",17,1,54,220,1,13,18,4.0999999999999996,12.9,0,null,80,"Dawson Knox","BUF",26,"TE",15,15,65,48,0.73799999999999999,517,10.8,6,25,45,8,3.2,34.5,0,null,81,"Tyler Boyd","CIN",28,"WR",16,14,1,1,23,0,0,0,0,0,0,0,1,1]
[null,null,null,null,80,"Blaine Gabbert","TAM",33,"QB",1,0,null,6,8,75,29,1,12.5,0,0,2,13,3.6,6.1,4.8,29,119.3,57.9,0,0,0,3.63,6.13,null,null,null,80,"Justin Herbert","LAC",24,"QB",17,17,54,147,0,17,23,2.7,8.6,8,null,81,"Chris Moore","HOU",29,"WR",16,7,74,48,0.64900000000000002,548,11.4,2,24,52,7.4,3,34.299999999999997,0,null,82,"Kyle Trask","TAM",24,"QB",1,0,3,9,23,0,1,0,0,0,2,0.25,5,0.625]
[null,null,null,null,81,"Tyler Boyd","CIN",28,"WR",16,14,null,1,1,100,23,0,0,0,0,1,23,23,23,23,1.4,118.7,13.2,1,12,50,5.5,5.5,null,null,null,81,"Boston Scott","PHI",27,"RB",15,2,54,217,3,12,21,4,14.5,0,null,82,"Demarcus Robinson","BAL",28,"WR",17,5,75,48,0.64,458,9.5,2,23,31,6.1,2.8,26.9,2,null,83,"Brandon Allen","CIN",30,"QB",1,0,3,3,22,0,0,0,0,0,0,0,3,1]
[null,null,null,null,82,"Kyle Trask","TAM",24,"QB",1,0,null,3,9,33.299999999999997,23,0,0,0,0,1,9,2.6,2.6,7.7,23,42.4,1.6,0,0,0,2.56,2.56,null,null,null,82,"Kenneth Gainwell","PHI",23,"RB",17,0,53,240,4,17,13,4.5,14.1,0,null,83,"D'Andre Swift","DET",23,"RB",14,8,70,48,0.68600000000000005,389,8.1,3,17,25,5.6,3.4,27.8,1,null,84,"Riley Dixon","LAR",29,"P",17,0,2,2,18,0,0,0,0,0,0,0,2,1]
[null,null,null,null,83,"Brandon Allen","CIN",30,"QB",1,0,null,3,3,100,22,0,0,0,0,1,13,7.3,7.3,7.3,22,97.2,44.4,1,0,25,5.5,5.5,null,null,null,83,"Jacoby Brissett","CLE",30,"QB",16,11,49,243,2,28,22,5,15.2,6,null,84,"Zach Ertz","ARI",32,"TE",10,10,69,47,0.68100000000000005,406,8.6,4,24,32,5.9,4.7,40.6,0,null,85,"Braden Mann","NYJ",25,"P",17,0,1,2,17,0,0,0,0,0,1,0.5,1,0.5]
[null,null,null,null,84,"Riley Dixon","LAR",29,"P",17,0,null,2,2,100,18,0,0,0,0,2,12,9,9,9,1.1000000000000001,104.2,null,0,0,0,9,9,null,null,null,84,"Justice Hill","BAL",25,"RB",15,0,49,262,0,15,34,5.3,17.5,2,null,85,"Kalif Raymond","DET",28,"WR",17,7,64,47,0.73399999999999999,616,13.1,0,24,56,9.6,2.8,36.200000000000003,3,null,86,"Ryan Wright","MIN",22,"P",17,0,1,2,13,0,0,0,0,0,0,0,1,0.5]
[null,null,null,null,85,"Braden Mann","NYJ",25,"P",17,0,null,1,2,50,17,0,0,0,0,1,17,8.5,8.5,17,1,79.2,0,0,0,0,8.5,8.5,null,null,null,85,"Mac Jones","NWE",24,"QB",14,14,47,102,1,12,15,2.2000000000000002,7.3,5,null,86,"DeAndre Carter","LAC",29,"WR",17,7,65,46,0.70799999999999996,538,11.7,3,29,35,8.3000000000000007,2.7,31.6,3,null,87,"Josh Johnson","SFO",36,"QB",2,0,1,2,10,1,0,0,0,0,0,0,1,0.5]
[null,null,null,null,86,"Ryan Wright","MIN",22,"P",17,0,null,1,2,50,13,0,0,0,0,1,13,6.5,6.5,13,0.8,70.8,null,0,0,0,6.5,6.5,null,null,null,86,"Javonte Williams","DEN",22,"RB",4,4,47,204,0,9,17,4.3,51,1,null,87,"Chase Claypool","2TM",24,"WR",15,11,79,46,0.58199999999999996,451,9.8000000000000007,1,24,31,5.7,3.1,30.1,1,null,88,"Case Keenum","BUF",34,"QB",2,0,2,7,8,0,0,0,1,0.14299999999999999,2,0.28599999999999998,3,0.42899999999999999]
[null,null,null,null,87,"Josh Johnson","SFO",36,"QB",2,0,null,1,2,50,10,0,0,0,0,1,10,5,5,10,5,64.599999999999994,20.399999999999999,0,0,0,5,5,null,null,null,87,"Jamycal Hasty","JAX",26,"RB",17,0,46,194,2,7,61,4.2,11.4,0,null,88,"James Conner","ARI",27,"RB",13,13,58,46,0.79300000000000004,300,6.5,1,13,22,5.2,3.5,23.1,3,null,89,"Jack Fox","DET",26,"P",17,0,1,1,6,0,0,0,0,0,0,0,1,1]
[null,null,null,null,88,"Case Keenum","BUF",34,"QB",2,0,null,2,7,28.6,8,0,0,0,0,0,5,1.1000000000000001,1.1000000000000001,4,4,39.6,4.3,0,0,0,1.1399999999999999,1.1399999999999999,null,null,null,88,"Elijah Mitchell","SFO",24,"RB",5,1,45,279,2,15,37,6.2,55.8,0,null,89,"Antonio Gibson","WAS",24,"RB",15,6,58,46,0.79300000000000004,353,7.7,2,18,26,6.1,3.1,23.5,1,null,90,"Najee Harris","PIT",24,"RB",17,17,1,1,4,0,0,0,0,0,0,0,1,1]
[null,null,null,null,89,"Jack Fox","DET",26,"P",17,0,null,1,1,100,6,0,0,0,0,1,6,6,6,6,0.4,91.7,null,0,0,0,6,6,null,null,null,89,"Dak Prescott","DAL",29,"QB",12,12,45,182,1,19,25,4,15.2,4,null,"Rk","Player","Tm","Age","Pos","G","GS","Tgt","Rec","Ctch%","Yds","Y/R","TD","1D","Lng","Y/Tgt","R/G","Y/G","Fmb",null,91,"Derrick Henry ","TEN",28,"RB",16,16,2,2,4,0,0,0,0,0,0,0,2,1]
[null,null,null,null,"Rk","Player","Tm","Age","Pos","G","GS","QBrec","Cmp","Att","Cmp%","Yds","TD","TD%","Int","Int%","1D","Lng","Y/A","AY/A","Y/C","Y/G","Rate","QBR","Sk","Yds","Sk%","NY/A","ANY/A","4QC","GWD",null,"Rk","Player","Tm","Age","Pos","G","GS","Att","Yds","TD","1D","Lng","Y/A","Y/G","Fmb",null,90,"Marvin Jones","JAX",32,"WR",16,10,81,46,0.56799999999999995,529,11.5,3,29,37,6.5,2.9,33.1,0,null,92,"Mack Hollins","LVR",29,"WR",17,16,1,1,4,0,0,0,0,0,0,0,1,1]
[null,null,null,null,90,"Najee Harris","PIT",24,"RB",17,17,null,1,1,100,4,0,0,0,0,0,4,4,4,4,0.2,83.3,10,0,0,0,4,4,null,null,null,90,"Tyler Huntley","BAL",24,"QB",6,4,43,137,1,12,14,3.2,22.8,3,null,91,"Darius Slayton","NYG",25,"WR",16,11,71,46,0.64800000000000002,724,15.7,2,30,55,10.199999999999999,2.9,45.3,2,null,93,"Andy Lee","ARI",40,"P",17,0,1,1,4,0,0,0,0,0,0,0,1,1]
[null,null,null,null,91,"Derrick Henry ","TEN",28,"RB",16,16,null,2,2,100,4,1,50,0,0,1,3,2,12,2,0.3,118.7,43.2,0,0,0,2,12,null,null,null,91,"Jordan Mason","SFO",23,"RB",16,0,43,258,1,10,55,6,16.100000000000001,0,null,92,"Noah Brown","DAL",26,"WR",16,13,74,43,0.58099999999999996,555,12.9,3,25,51,7.5,2.7,34.700000000000003,1,null,94,"Braxton Berrios","NYJ",27,"WR",17,2,1,1,2,0,0,0,0,0,0,0,1,1]
[null,null,null,null,92,"Mack Hollins","LVR",29,"WR",17,16,null,1,1,100,4,0,0,0,0,0,4,4,4,4,0.2,83.3,22.1,0,0,0,4,4,null,null,null,92,"Justin Jackson","DET",26,"RB",16,0,42,170,1,8,27,4,10.6,0,null,93,"Romeo Doubs","GNB",22,"WR",13,7,67,42,0.627,425,10.1,3,20,26,6.3,3.2,32.700000000000003,2,null,95,"Chase Claypool","2TM",24,"WR",15,11,1,1,1,0,0,0,0,0,0,0,1,1]
[null,null,null,null,93,"Andy Lee","ARI",40,"P",17,0,null,1,1,100,4,0,0,0,0,1,4,4,4,4,0.2,83.3,null,0,0,0,4,4,null,null,null,93,"Dare Ogunbowale","HOU",28,"RB",17,4,42,123,1,10,11,2.9,7.2,0,null,94,"Juwan Johnson","NOR",26,"TE",16,12,65,42,0.64600000000000002,508,12.1,7,25,41,7.8,2.6,31.8,0,null,96,"Rex Burkhead","HOU",32,"RB",16,0,0,1,0,0,0,0,0,0,1,1,0,0]
[null,null,null,null,94,"Braxton Berrios","NYJ",27,"WR",17,2,null,1,1,100,2,1,100,0,0,1,2,2,22,2,0.1,118.7,99.5,0,0,0,2,22,null,null,null,94,"Deebo Samuel","SFO",26,"WR",13,12,42,232,3,8,51,5.5,17.8,3,null,95,"Isaiah McKenzie","BUF",27,"WR",15,8,65,42,0.64600000000000002,423,10.1,4,27,30,6.5,2.8,28.2,0,null,97,"Amari Cooper","CLE",28,"WR",17,17,0,1,0,0,0,0,0,0,1,1,0,0]
[null,null,null,null,95,"Chase Claypool","2TM",24,"WR",15,11,null,1,1,100,1,1,100,0,0,1,1,1,21,1,0.1,118.7,100,0,0,0,1,21,null,null,null,95,"Royce Freeman","HOU",26,"RB",4,1,41,117,0,7,11,2.9,29.3,1,null,96,"Cade Otton","TAM",23,"TE",16,11,65,42,0.64600000000000002,391,9.3000000000000007,2,19,35,6,2.6,24.4,0,null,98,"DeeJay Dallas","SEA",24,"RB",15,0,0,1,0,0,0,0,0,0,1,1,0,0]
[null,null,null,null,96,"Rex Burkhead","HOU",32,"RB",16,0,null,0,1,0,0,0,0,0,0,0,0,0,0,null,0,39.6,2.9,0,0,0,0,0,null,null,null,96,"Malik Davis","DAL",24,"RB",12,0,38,161,1,6,23,4.2,13.4,0,null,97,"Marquez Valdes-Scantling","KAN",28,"WR",17,11,81,42,0.51900000000000002,687,16.399999999999999,2,32,57,8.5,2.5,40.4,0,null,99,"Phillip Dorsett","HOU",29,"WR",15,4,0,1,0,0,1,0,0,0,0,0,0,0]
[null,null,null,null,97,"Amari Cooper","CLE",28,"WR",17,17,null,0,1,0,0,0,0,1,100,0,0,0,-45,null,0,0,0,0,0,0,0,-45,null,null,null,97,"Curtis Samuel","WAS",26,"WR",17,12,38,187,1,11,21,4.9000000000000004,11,1,null,98,"Michael Carter","NYJ",23,"RB",16,10,54,41,0.75900000000000001,288,7,0,12,37,5.3,2.6,18,2,null,100,"Leonard Fournette","TAM",27,"RB",16,9,0,1,0,0,0,0,0,0,0,0,0,0]
[null,null,null,null,98,"DeeJay Dallas","SEA",24,"RB",15,0,null,0,1,0,0,0,0,1,100,0,0,0,-45,null,0,0,0,0,0,0,0,-45,null,null,null,98,"Jonathan Williams","WAS",28,"RB",13,2,37,152,0,6,23,4.0999999999999996,11.7,0,null,99,"Najee Harris","PIT",24,"RB",17,17,53,41,0.77400000000000002,229,5.6,3,16,19,4.3,2.4,13.5,3,null,101,"Chad Henne","KAN",37,"QB",3,0,0,2,0,1,0,0,1,0.5,0,0,0,0]
[null,null,null,null,99,"Phillip Dorsett","HOU",29,"WR",15,4,null,0,1,0,0,0,0,0,0,0,0,0,0,null,0,39.6,2.5,0,0,0,0,0,null,null,null,99,"Sony Michel","LAC",27,"RB",10,0,36,106,0,8,12,2.9,10.6,0,null,100,"Hunter Henry","NWE",28,"TE",17,14,59,41,0.69499999999999995,509,12.4,2,23,39,8.6,2.4,29.9,0,null,102,"Christian Kirk","JAX",26,"WR",17,17,0,1,0,0,0,0,0,0,1,1,0,0]
[null,null,null,null,100,"Leonard Fournette","TAM",27,"RB",16,9,null,0,1,0,0,0,0,1,100,0,0,0,-45,null,0,0,0,0,0,0,0,-45,null,null,null,100,"Deshaun Watson","CLE",27,"QB",6,6,36,175,1,10,21,4.9000000000000004,29.2,1,null,101,"Austin Hooper","TEN",28,"TE",17,2,60,41,0.68300000000000005,444,10.8,2,28,24,7.4,2.4,26.1,0,null,103,"Cooper Kupp","LAR",29,"WR",9,9,0,1,0,0,0,0,0,0,1,1,0,0]
[null,null,null,null,101,"Chad Henne","KAN",37,"QB",3,0,null,0,2,0,0,0,0,0,0,0,0,0,0,null,0,39.6,3.5,0,0,0,0,0,null,null,null,101,"DeeJay Dallas","SEA",24,"RB",15,0,35,186,0,9,27,5.3,12.4,1,null,102,"Rondale Moore","ARI",22,"WR",8,8,56,41,0.73199999999999998,414,10.1,1,16,38,7.4,5.0999999999999996,51.8,0,null,104,"James Proche","BAL",26,"WR",15,0,0,1,0,0,0,0,0,0,0,0,1,1]
[null,null,null,null,102,"Christian Kirk","JAX",26,"WR",17,17,null,0,1,0,0,0,0,0,0,0,0,0,0,null,0,39.6,9.9,0,0,0,0,0,null,null,null,102,"Kyren Williams","LAR",22,"RB",10,0,35,139,0,6,17,4,13.9,0,null,103,"Alec Pierce","IND",22,"WR",16,12,78,41,0.52600000000000002,593,14.5,2,28,47,7.6,2.6,37.1,1,null,105,"Tommy Townsend","KAN",26,"P",17,0,0,1,0,0,0,0,0,0,1,1,0,0]
[null,null,null,null,103,"Cooper Kupp","LAR",29,"WR",9,9,null,0,1,0,0,0,0,0,0,0,0,0,0,null,0,39.6,3,0,0,0,0,0,null,null,null,103,"Tyrion Davis-Price","SFO",22,"RB",6,0,34,99,0,5,20,2.9,16.5,0,null,104,"Christian Watson","GNB",23,"WR",14,11,66,41,0.621,611,14.9,7,28,63,9.3000000000000007,2.9,43.6,0,null,106,"Garrett Wilson","NYJ",22,"WR",17,12,0,1,0,0,1,0,0,0,0,0,0,0]
[null,null,null,null,104,"James Proche","BAL",26,"WR",15,0,null,0,1,0,0,0,0,1,100,0,0,0,-45,null,0,0,0,0,0,0,0,-45,null,null,null,104,"Aaron Rodgers","GNB",39,"QB",17,17,34,94,1,9,18,2.8,5.5,8,null,105,"Darnell Mooney","CHI",25,"WR",12,12,61,40,0.65600000000000003,493,12.3,2,20,56,8.1,3.3,41.1,0]
[null,null,null,null,105,"Tommy Townsend","KAN",26,"P",17,0,null,0,1,0,0,0,0,0,0,0,0,0,0,null,0,39.6,null,0,0,0,0,0,null,null,null,105,"Ryan Tannehill","TEN",34,"QB",12,12,34,98,2,12,17,2.9,8.1999999999999993,3,null,106,"Olamide Zaccheaus","ATL",25,"WR",17,13,61,40,0.65600000000000003,533,13.3,3,25,45,8.6999999999999993,2.4,31.4,1]
[null,null,null,null,106,"Garrett Wilson","NYJ",22,"WR",17,12,null,0,1,0,0,0,0,0,0,0,0,0,0,null,0,39.6,0.8,0,0,0,0,0,null,null,null,106,"Davis Mills","HOU",24,"QB",15,15,32,108,2,8,17,3.4,7.2,8,null,107,"Dalvin Cook","MIN",27,"RB",17,17,56,39,0.69599999999999995,295,7.6,2,16,64,5.3,2.2999999999999998,17.399999999999999,4]
[null,null,null,null,null,null,null,null,null,null,null,null,null,null,null,null,null,null,null,null,null,null,null,null,null,null,null,null,null,null,null,null,null,null,null,null,107,"Gary Brightwell","NYG",23,"RB",17,0,31,141,1,9,25,4.5,8.3000000000000007,0,null,108,"Michael Gallup","DAL",26,"WR",14,11,74,39,0.52700000000000002,424,10.9,4,25,27,5.7,2.8,30.3,0]
[null,null,null,null,null,null,null,null,null,null,null,null,null,null,null,null,null,null,null,null,null,null,null,null,null,null,null,null,null,null,null,null,null,null,null,null,108,"Kirk Cousins","MIN",34,"QB",17,17,31,97,2,11,19,3.1,5.7,7,null,109,"Tony Pollard","DAL",25,"RB",16,4,55,39,0.70899999999999996,371,9.5,3,18,68,6.7,2.4,23.2,0]
[null,null,null,null,null,null,null,null,null,null,null,null,null,null,null,null,null,null,null,null,null,null,null,null,null,null,null,null,null,null,null,null,null,null,null,null,109,"Baker Mayfield","2TM",27,null,12,10,31,89,1,7,17,2.9,7.4,9,null,110,"Ben Skowronek","LAR",25,"WR",14,11,61,39,0.63900000000000001,376,9.6,0,16,32,6.2,2.8,26.9,0]
[null,null,null,null,null,null,null,null,null,null,null,null,null,null,null,null,null,null,null,null,null,null,null,null,null,null,null,null,null,null,null,null,null,null,null,null,110,"Andy Dalton","NOR",35,"QB",14,14,30,54,0,6,14,1.8,3.9,5,null,111,"Logan Thomas","WAS",31,"TE",14,13,61,39,0.63900000000000001,323,8.3000000000000007,1,15,27,5.3,2.8,23.1,0]
[null,null,null,null,null,null,null,null,null,null,null,null,null,null,null,null,null,null,null,null,null,null,null,null,null,null,null,null,null,null,null,null,null,null,null,null,111,"Ty Johnson","NYJ",25,"RB",17,1,30,160,1,5,32,5.3,9.4,0,null,112,"Samaje Perine","CIN",27,"RB",16,2,51,38,0.745,287,7.6,4,11,32,5.6,2.4,17.899999999999999,0]
[null,null,null,null,null,null,null,null,null,null,null,null,null,null,null,null,null,null,null,null,null,null,null,null,null,null,null,null,null,null,null,null,null,null,null,null,112,"Tom Brady","TAM",45,"QB",17,17,29,-1,1,5,2,0,-0.1,5,null,113,"Josh Reynolds","DET",27,"WR",14,11,59,38,0.64400000000000002,479,12.6,3,25,31,8.1,2.7,34.200000000000003,0]
[null,null,null,null,null,null,null,null,null,null,null,null,null,null,null,null,null,null,null,null,null,null,null,null,null,null,null,null,null,null,null,null,null,null,null,null,113,"Jared Goff","DET",28,"QB",17,17,29,73,0,5,14,2.5,4.3,7,null,114,"Devin Singletary","BUF",25,"RB",16,16,52,38,0.73099999999999998,280,7.4,1,15,22,5.4,2.4,17.5,3]
[null,null,null,null,null,null,null,null,null,null,null,null,null,null,null,null,null,null,null,null,null,null,null,null,null,null,null,null,null,null,null,null,null,null,null,null,114,"Taylor Heinicke","WAS",29,"QB",9,9,28,96,1,6,15,3.4,10.7,7,null,115,"Jordan Akins","HOU",30,"TE",15,3,54,37,0.68500000000000005,495,13.4,5,23,46,9.1999999999999993,2.5,33,1]
[null,null,null,null,null,null,null,null,null,null,null,null,null,null,null,null,null,null,null,null,null,null,null,null,null,null,null,null,null,null,null,null,null,null,null,null,115,"Zach Wilson","NYJ",23,"QB",9,9,28,102,1,7,18,3.6,11.3,1,null,116,"Rex Burkhead","HOU",32,"RB",16,0,51,37,0.72499999999999998,204,5.5,1,8,17,4,2.2999999999999998,12.8,0]
[null,null,null,null,null,null,null,null,null,null,null,null,null,null,null,null,null,null,null,null,null,null,null,null,null,null,null,null,null,null,null,null,null,null,null,null,116,"Keaontay Ingram","ARI",23,"RB",12,0,27,60,1,4,13,2.2000000000000002,5,0,null,117,"Nico Collins","HOU",23,"WR",10,7,66,37,0.56100000000000005,481,13,2,21,58,7.3,3.7,48.1,0]
[null,null,null,null,null,null,null,null,null,null,null,null,null,null,null,null,null,null,null,null,null,null,null,null,null,null,null,null,null,null,null,null,null,null,null,null,117,"Matt Ryan","IND",37,"QB",12,12,27,70,1,9,39,2.6,5.8,15,null,118,"Devin Duvernay","BAL",25,"WR",14,13,49,37,0.755,407,11,3,19,31,8.3000000000000007,2.6,29.1,1]
[null,null,null,null,null,null,null,null,null,null,null,null,null,null,null,null,null,null,null,null,null,null,null,null,null,null,null,null,null,null,null,null,null,null,null,null,118,"Malik Willis","TEN",23,"QB",8,3,27,123,1,8,17,4.5999999999999996,15.4,3,null,119,"Isaiah Hodgins","2TM",24,"WR",10,5,48,37,0.77100000000000002,392,10.6,4,24,29,8.1999999999999993,3.7,39.200000000000003,1]
[null,null,null,null,null,null,null,null,null,null,null,null,null,null,null,null,null,null,null,null,null,null,null,null,null,null,null,null,null,null,null,null,null,null,null,null,119,"Rex Burkhead","HOU",32,"RB",16,0,26,80,0,4,9,3.1,5,0,null,"Rk","Player","Tm","Age","Pos","G","GS","Tgt","Rec","Ctch%","Yds","Y/R","TD","1D","Lng","Y/Tgt","R/G","Y/G","Fmb"]
[null,null,null,null,null,null,null,null,null,null,null,null,null,null,null,null,null,null,null,null,null,null,null,null,null,null,null,null,null,null,null,null,null,null,null,null,"Rk","Player","Tm","Age","Pos","G","GS","Att","Yds","TD","1D","Lng","Y/A","Y/G","Fmb",null,120,"Elijah Moore","NYJ",22,"WR",16,9,65,37,0.56899999999999995,446,12.1,1,22,42,6.9,2.2999999999999998,27.9,1]
[null,null,null,null,null,null,null,null,null,null,null,null,null,null,null,null,null,null,null,null,null,null,null,null,null,null,null,null,null,null,null,null,null,null,null,null,120,"Sam Darnold","CAR",25,"QB",6,6,26,106,2,10,26,4.0999999999999996,17.7,6,null,121,"Isaiah Likely","BAL",22,"TE",16,2,60,36,0.6,373,10.4,3,18,34,6.2,2.2999999999999998,23.3,0]
[null,null,null,null,null,null,null,null,null,null,null,null,null,null,null,null,null,null,null,null,null,null,null,null,null,null,null,null,null,null,null,null,null,null,null,null,121,"Hassan Haskins","TEN",23,"RB",15,1,25,93,0,5,12,3.7,6.2,0,null,122,"Hunter Renfrow","LVR",27,"WR",10,1,50,36,0.72,330,9.1999999999999993,2,18,27,6.6,3.6,33,3]
[null,null,null,null,null,null,null,null,null,null,null,null,null,null,null,null,null,null,null,null,null,null,null,null,null,null,null,null,null,null,null,null,null,null,null,null,122,"Mike Boone","DEN",27,"RB",9,0,24,102,0,6,18,4.3,11.3,0,null,123,"Kendrick Bourne","NWE",27,"WR",16,2,48,35,0.72899999999999998,434,12.4,1,22,41,9,2.2000000000000002,27.1,2]
[null,null,null,null,null,null,null,null,null,null,null,null,null,null,null,null,null,null,null,null,null,null,null,null,null,null,null,null,null,null,null,null,null,null,null,null,123,"Derek Carr","LVR",31,"QB",15,15,24,102,0,10,20,4.3,6.8,4,null,124,"Jahan Dotson","WAS",22,"WR",12,10,61,35,0.57399999999999995,523,14.9,7,26,61,8.6,2.9,43.6,0]
[null,null,null,null,null,null,null,null,null,null,null,null,null,null,null,null,null,null,null,null,null,null,null,null,null,null,null,null,null,null,null,null,null,null,null,null,124,"Trestan Ebner","CHI",23,"RB",17,0,24,54,0,2,11,2.2999999999999998,3.2,2,null,125,"Travis Etienne","JAX",23,"RB",17,12,45,35,0.77800000000000002,316,9,0,16,30,7,2.1,18.600000000000001,5]
[null,null,null,null,null,null,null,null,null,null,null,null,null,null,null,null,null,null,null,null,null,null,null,null,null,null,null,null,null,null,null,null,null,null,null,null,125,"Nyheim Hines","2TM",26,"RB",16,5,24,33,1,2,9,1.4,2.1,2,null,126,"Kareem Hunt","CLE",27,"RB",17,0,44,35,0.79500000000000004,210,6,1,11,24,4.8,2.1,12.4,1]
[null,null,null,null,null,null,null,null,null,null,null,null,null,null,null,null,null,null,null,null,null,null,null,null,null,null,null,null,null,null,null,null,null,null,null,null,126,"Raheem Blackshear","CAR",23,"RB",13,1,23,77,3,7,16,3.3,5.9,1,null,127,"Jauan Jennings","SFO",25,"WR",16,4,56,35,0.625,416,11.9,1,23,44,7.4,2.2000000000000002,26,1]
[null,null,null,null,null,null,null,null,null,null,null,null,null,null,null,null,null,null,null,null,null,null,null,null,null,null,null,null,null,null,null,null,null,null,null,null,127,"Jimmy Garoppolo","SFO",31,"QB",11,10,23,33,2,12,6,1.4,3,3,null,128,"Randall Cobb","GNB",32,"WR",13,3,50,34,0.68,417,12.3,1,19,40,8.3000000000000007,2.6,32.1,1]
[null,null,null,null,null,null,null,null,null,null,null,null,null,null,null,null,null,null,null,null,null,null,null,null,null,null,null,null,null,null,null,null,null,null,null,null,128,"Craig Reynolds","DET",26,"RB",9,0,23,102,0,4,21,4.4000000000000004,11.3,0,null,129,"Will Dissly","SEA",26,"TE",15,15,38,34,0.89500000000000002,349,10.3,3,20,38,9.1999999999999993,2.2999999999999998,23.3,0]
[null,null,null,null,null,null,null,null,null,null,null,null,null,null,null,null,null,null,null,null,null,null,null,null,null,null,null,null,null,null,null,null,null,null,null,null,129,"Tua Tagovailoa","MIA",24,"QB",13,13,23,70,0,4,18,3,5.4,6,null,130,"David Montgomery","CHI",25,"RB",16,16,40,34,0.85,316,9.3000000000000007,1,10,32,7.9,2.1,19.8,2]
[null,null,null,null,null,null,null,null,null,null,null,null,null,null,null,null,null,null,null,null,null,null,null,null,null,null,null,null,null,null,null,null,null,null,null,null,130,"Dontrell Hilliard","TEN",27,"RB",12,1,22,145,0,4,30,6.6,12.1,0,null,131,"Treylon Burks","TEN",22,"WR",11,6,54,33,0.61099999999999999,444,13.5,1,19,51,8.1999999999999993,3,40.4,0]
[null,null,null,null,null,null,null,null,null,null,null,null,null,null,null,null,null,null,null,null,null,null,null,null,null,null,null,null,null,null,null,null,null,null,null,null,131,"J.D. McKissic","WAS",29,"RB",8,0,22,95,0,5,33,4.3,11.9,0,null,132,"Greg Dulcich","DEN",22,"TE",10,6,55,33,0.6,411,12.5,2,18,39,7.5,3.3,41.1,0]
[null,null,null,null,null,null,null,null,null,null,null,null,null,null,null,null,null,null,null,null,null,null,null,null,null,null,null,null,null,null,null,null,null,null,null,null,132,"Brock Purdy","SFO",23,"QB",9,5,22,13,1,5,13,0.6,1.4,0,null,133,"Derrick Henry ","TEN",28,"RB",16,16,41,33,0.80500000000000005,398,12.1,0,11,69,9.6999999999999993,2.1,24.9,6]
[null,null,null,null,null,null,null,null,null,null,null,null,null,null,null,null,null,null,null,null,null,null,null,null,null,null,null,null,null,null,null,null,null,null,null,null,133,"Carson Wentz","WAS",30,"QB",8,7,22,86,1,4,18,3.9,10.8,6,null,134,"Foster Moreau","LVR",25,"TE",15,14,54,33,0.61099999999999999,420,12.7,2,24,33,7.8,2.2000000000000002,28,1]
[null,null,null,null,null,null,null,null,null,null,null,null,null,null,null,null,null,null,null,null,null,null,null,null,null,null,null,null,null,null,null,null,null,null,null,null,134,"Avery Williams","ATL",24,"RB",17,3,22,109,1,6,21,5,6.4,1,null,135,"Allen Robinson","LAR",29,"WR",10,10,52,33,0.63500000000000001,339,10.3,3,23,29,6.5,3.3,33.9,0]
[null,null,null,null,null,null,null,null,null,null,null,null,null,null,null,null,null,null,null,null,null,null,null,null,null,null,null,null,null,null,null,null,null,null,null,null,135,"Darrel Williams","ARI",27,"RB",6,0,21,102,1,8,30,4.9000000000000004,17,0,null,136,"Quez Watkins","PHI",24,"WR",17,8,51,33,0.64700000000000002,354,10.7,3,13,53,6.9,1.9,20.8,1]
[null,null,null,null,null,null,null,null,null,null,null,null,null,null,null,null,null,null,null,null,null,null,null,null,null,null,null,null,null,null,null,null,null,null,null,null,136,"Jeff Driskel","HOU",29,"QB",7,2,20,75,0,4,10,3.8,10.7,0,null,137,"Corey Davis","NYJ",27,"WR",13,10,64,32,0.5,536,16.8,2,28,66,8.4,2.5,41.2,0]
[null,null,null,null,null,null,null,null,null,null,null,null,null,null,null,null,null,null,null,null,null,null,null,null,null,null,null,null,null,null,null,null,null,null,null,null,137,"Benny Snell Jr.","PIT",24,"RB",17,0,20,90,1,6,16,4.5,5.3,0,null,138,"Mike Gesicki","MIA",27,"TE",17,1,52,32,0.61499999999999999,362,11.3,5,19,32,7,1.9,21.3,0]
[null,null,null,null,null,null,null,null,null,null,null,null,null,null,null,null,null,null,null,null,null,null,null,null,null,null,null,null,null,null,null,null,null,null,null,null,138,"Travis Homer","SEA",24,"RB",10,1,19,74,0,4,16,3.9,7.4,1,null,139,"Chigoziem Okonkwo","TEN",23,"TE",17,8,46,32,0.69599999999999995,450,14.1,3,22,48,9.8000000000000007,1.9,26.5,0]
[null,null,null,null,null,null,null,null,null,null,null,null,null,null,null,null,null,null,null,null,null,null,null,null,null,null,null,null,null,null,null,null,null,null,null,null,139,"Bryce Perkins","LAR",26,"QB",5,1,19,90,0,6,23,4.7,18,0,null,140,"Nelson Agholor","NWE",29,"WR",16,7,53,31,0.58499999999999996,362,11.7,2,12,44,6.8,1.9,22.6,2]
[null,null,null,null,null,null,null,null,null,null,null,null,null,null,null,null,null,null,null,null,null,null,null,null,null,null,null,null,null,null,null,null,null,null,null,null,140,"Mitchell Trubisky","PIT",28,"QB",7,5,19,38,2,7,9,2,5.4,0,null,141,"Harrison Bryant","CLE",24,"TE",17,9,42,31,0.73799999999999999,239,7.7,1,12,30,5.7,1.8,14.1,0]
[null,null,null,null,null,null,null,null,null,null,null,null,null,null,null,null,null,null,null,null,null,null,null,null,null,null,null,null,null,null,null,null,null,null,null,null,141,"Malcolm Brown","LAR",29,"RB",11,0,18,81,1,3,23,4.5,7.4,0,null,142,"Kylen Granson","IND",24,"TE",13,4,40,31,0.77500000000000002,302,9.6999999999999993,0,17,32,7.6,2.4,23.2,1]
[null,null,null,null,null,null,null,null,null,null,null,null,null,null,null,null,null,null,null,null,null,null,null,null,null,null,null,null,null,null,null,null,null,null,null,null,142,"Kevin Harris","NWE",22,"RB",5,1,18,52,1,3,14,2.9,10.4,0,null,143,"Raheem Mostert","MIA",30,"RB",16,14,42,31,0.73799999999999999,202,6.5,2,11,25,4.8,1.9,12.6,1]
[null,null,null,null,null,null,null,null,null,null,null,null,null,null,null,null,null,null,null,null,null,null,null,null,null,null,null,null,null,null,null,null,null,null,null,null,143,"Isaiah Spiller","LAC",21,"RB",6,0,18,41,0,2,11,2.2999999999999998,6.8,0,null,144,"DeVante Parker","NWE",29,"WR",13,11,47,31,0.66,539,17.399999999999999,3,25,43,11.5,2.4,41.5,0]
[null,null,null,null,null,null,null,null,null,null,null,null,null,null,null,null,null,null,null,null,null,null,null,null,null,null,null,null,null,null,null,null,null,null,null,null,144,"Brandon Bolden","LVR",32,"RB",16,0,17,66,0,3,12,3.9,4.0999999999999996,0,null,145,"Daniel Bellinger","NYG",22,"TE",12,11,35,30,0.85699999999999998,268,8.9,2,14,24,7.7,2.5,22.3,1]
[null,null,null,null,null,null,null,null,null,null,null,null,null,null,null,null,null,null,null,null,null,null,null,null,null,null,null,null,null,null,null,null,null,null,null,null,145,"Sam Ehlinger","IND",24,"QB",4,3,17,87,0,5,19,5.0999999999999996,21.8,2,null,146,"DJ Chark","DET",26,"WR",11,10,52,30,0.57699999999999996,502,16.7,3,24,51,9.6999999999999993,2.7,45.6,0]
[null,null,null,null,null,null,null,null,null,null,null,null,null,null,null,null,null,null,null,null,null,null,null,null,null,null,null,null,null,null,null,null,null,null,null,null,146,"Ronald Jones II","KAN",25,"RB",6,0,17,70,1,4,13,4.0999999999999996,11.7,0,null,147,"Nyheim Hines","2TM",26,"RB",16,5,37,30,0.81100000000000005,241,8,1,11,22,6.5,1.9,15.1,2]
[null,null,null,null,null,null,null,null,null,null,null,null,null,null,null,null,null,null,null,null,null,null,null,null,null,null,null,null,null,null,null,null,null,null,null,null,147,"Jaret Patterson","WAS",23,"RB",3,0,17,78,0,3,14,4.5999999999999996,26,0,null,148,"Deon Jackson","IND",23,"RB",16,2,34,30,0.88200000000000001,209,7,1,10,27,6.1,1.9,13.1,1]
[null,null,null,null,null,null,null,null,null,null,null,null,null,null,null,null,null,null,null,null,null,null,null,null,null,null,null,null,null,null,null,null,null,null,null,null,148,"Brandon Powell","LAR",27,"WR",17,6,17,80,0,6,20,4.7,4.7,1,null,149,"Dameon Pierce","HOU",22,"RB",13,13,39,30,0.76900000000000002,165,5.5,1,7,16,4.2,2.2999999999999998,12.7,4]
[null,null,null,null,null,null,null,null,null,null,null,null,null,null,null,null,null,null,null,null,null,null,null,null,null,null,null,null,null,null,null,null,null,null,null,null,149,"Ke'Shawn Vaughn","TAM",25,"RB",15,0,17,53,0,3,12,3.1,3.5,0,null,"Rk","Player","Tm","Age","Pos","G","GS","Tgt","Rec","Ctch%","Yds","Y/R","TD","1D","Lng","Y/Tgt","R/G","Y/G","Fmb"]
[null,null,null,null,null,null,null,null,null,null,null,null,null,null,null,null,null,null,null,null,null,null,null,null,null,null,null,null,null,null,null,null,null,null,null,null,"Rk","Player","Tm","Age","Pos","G","GS","Att","Yds","TD","1D","Lng","Y/A","Y/G","Fmb",null,150,"Trent Sherfield","MIA",26,"WR",17,4,51,30,0.58799999999999997,417,13.9,2,18,75,8.1999999999999993,1.8,24.5,0]
[null,null,null,null,null,null,null,null,null,null,null,null,null,null,null,null,null,null,null,null,null,null,null,null,null,null,null,null,null,null,null,null,null,null,null,null,150,"Zamir White","LVR",23,"RB",14,0,17,70,0,4,22,4.0999999999999996,5,0,null,151,"Trey McBride","ARI",23,"TE",16,13,39,29,0.74399999999999999,265,9.1,1,12,29,6.8,1.8,16.600000000000001,1]
[null,null,null,null,null,null,null,null,null,null,null,null,null,null,null,null,null,null,null,null,null,null,null,null,null,null,null,null,null,null,null,null,null,null,null,null,151,"Trey Lance","SFO",22,"QB",2,2,16,67,0,7,13,4.2,33.5,1,null,152,"AJ Dillon","GNB",24,"RB",17,3,43,28,0.65100000000000002,206,7.4,0,9,17,4.8,1.6,12.1,1]
[null,null,null,null,null,null,null,null,null,null,null,null,null,null,null,null,null,null,null,null,null,null,null,null,null,null,null,null,null,null,null,null,null,null,null,null,152,"Marlon Mack","2TM",26,null,8,0,16,84,1,4,17,5.3,10.5,0,null,153,"Noah Gray","KAN",23,"TE",17,8,34,28,0.82399999999999995,299,10.7,1,14,27,8.8000000000000007,1.6,17.600000000000001,0]
[null,null,null,null,null,null,null,null,null,null,null,null,null,null,null,null,null,null,null,null,null,null,null,null,null,null,null,null,null,null,null,null,null,null,null,null,153,"Desmond Ridder","ATL",23,"QB",4,4,16,64,0,4,18,4,16,3,null,154,"Terrace Marshall Jr.","CAR",22,"WR",14,9,47,28,0.59599999999999997,490,17.5,1,24,43,10.4,2,35,2]
[null,null,null,null,null,null,null,null,null,null,null,null,null,null,null,null,null,null,null,null,null,null,null,null,null,null,null,null,null,null,null,null,null,null,null,null,154,"Corey Clement","ARI",28,"RB",9,1,15,55,1,6,12,3.7,6.1,0,null,155,"Kyle Pitts","ATL",22,"TE",10,10,59,28,0.47499999999999998,356,12.7,2,20,33,6,2.8,35.6,0]
[null,null,null,null,null,null,null,null,null,null,null,null,null,null,null,null,null,null,null,null,null,null,null,null,null,null,null,null,null,null,null,null,null,null,null,null,155,"Phillip Lindsay","IND",28,"RB",3,0,15,49,0,1,15,3.3,16.3,0,null,156,"Rashid Shaheed","NOR",24,"WR",12,6,34,28,0.82399999999999995,488,17.399999999999999,2,18,68,14.4,2.2999999999999998,40.700000000000003,1]
[null,null,null,null,null,null,null,null,null,null,null,null,null,null,null,null,null,null,null,null,null,null,null,null,null,null,null,null,null,null,null,null,null,null,null,null,156,"Trace McSorley","ARI",27,"QB",6,1,15,61,0,3,14,4.0999999999999996,10.199999999999999,2,null,157,"Jonathan Taylor","IND",23,"RB",11,11,40,28,0.7,143,5.0999999999999996,0,4,19,3.6,2.5,13,3]
[null,null,null,null,null,null,null,null,null,null,null,null,null,null,null,null,null,null,null,null,null,null,null,null,null,null,null,null,null,null,null,null,null,null,null,null,157,"Darrynton Evans","CHI",24,"RB",6,0,14,64,0,3,21,4.5999999999999996,10.7,0,null,158,"Darren Waller","LVR",30,"TE",9,6,43,28,0.65100000000000002,388,13.9,3,18,34,9,3.1,43.1,0]
[null,null,null,null,null,null,null,null,null,null,null,null,null,null,null,null,null,null,null,null,null,null,null,null,null,null,null,null,null,null,null,null,null,null,null,null,158,"Colt McCoy","ARI",36,"QB",4,3,14,36,0,5,9,2.6,9,2,null,159,"Jaylen Warren","PIT",24,"RB",16,0,33,28,0.84799999999999998,214,7.6,0,14,26,6.5,1.8,13.4,1]
[null,null,null,null,null,null,null,null,null,null,null,null,null,null,null,null,null,null,null,null,null,null,null,null,null,null,null,null,null,null,null,null,null,null,null,null,159,"Jarrett Stidham","LVR",26,"QB",5,2,14,84,0,7,11,6,16.8,3,null,160,"Nick Chubb","CLE",27,"RB",17,17,37,27,0.73,239,8.9,1,12,26,6.5,1.6,14.1,1]
[null,null,null,null,null,null,null,null,null,null,null,null,null,null,null,null,null,null,null,null,null,null,null,null,null,null,null,null,null,null,null,null,null,null,null,null,160,"Skylar Thompson","MIA",25,"QB",7,2,14,21,0,1,9,1.5,3,2,null,161,"Marquise Goodwin","SEA",32,"WR",13,2,42,27,0.64300000000000002,387,14.3,4,18,38,9.1999999999999993,2.1,29.8,0]
[null,null,null,null,null,null,null,null,null,null,null,null,null,null,null,null,null,null,null,null,null,null,null,null,null,null,null,null,null,null,null,null,null,null,null,null,161,"Larry Rountree","LAC",23,"RB",4,0,13,19,0,0,5,1.5,4.8,0,null,162,"J.D. McKissic","WAS",29,"RB",8,0,40,27,0.67500000000000004,173,6.4,0,7,14,4.3,3.4,21.6,0]
[null,null,null,null,null,null,null,null,null,null,null,null,null,null,null,null,null,null,null,null,null,null,null,null,null,null,null,null,null,null,null,null,null,null,null,null,162,"Steven Sims","PIT",25,"WR",12,2,13,70,0,5,22,5.4,5.8,3,null,163,"Latavius Murray","2TM",32,"RB",13,7,35,27,0.77100000000000002,132,4.9000000000000004,0,4,15,3.8,2.1,10.199999999999999,1]
[null,null,null,null,null,null,null,null,null,null,null,null,null,null,null,null,null,null,null,null,null,null,null,null,null,null,null,null,null,null,null,null,null,null,null,null,163,"Matthew Stafford","LAR",34,"QB",9,9,13,9,1,3,4,0.7,1,5,null,164,"Laviska Shenault Jr.","CAR",24,"WR",13,4,32,27,0.84399999999999997,272,10.1,1,10,67,8.5,2.1,20.9,0]
[null,null,null,null,null,null,null,null,null,null,null,null,null,null,null,null,null,null,null,null,null,null,null,null,null,null,null,null,null,null,null,null,null,null,null,null,164,"Jordan Wilkins","IND",28,"RB",4,0,13,58,0,2,9,4.5,14.5,0,null,165,"Jonnu Smith","NWE",27,"TE",14,8,38,27,0.71099999999999997,245,9.1,0,9,53,6.4,1.9,17.5,1]
[null,null,null,null,null,null,null,null,null,null,null,null,null,null,null,null,null,null,null,null,null,null,null,null,null,null,null,null,null,null,null,null,null,null,null,null,165,"Jamal Agnew","JAX",27,"WR",15,0,12,86,0,6,30,7.2,5.7,0,null,166,"Kenneth Walker III","SEA",22,"RB",15,11,35,27,0.77100000000000002,165,6.1,0,6,33,4.7,1.8,11,0]
[null,null,null,null,null,null,null,null,null,null,null,null,null,null,null,null,null,null,null,null,null,null,null,null,null,null,null,null,null,null,null,null,null,null,null,null,166,"Salvon Ahmed","MIA",24,"RB",12,0,12,64,1,4,11,5.3,5.3,0,null,167,"Ameer Abdullah","LVR",29,"RB",17,0,32,25,0.78100000000000003,211,8.4,1,8,23,6.6,1.5,12.4,0]
[null,null,null,null,null,null,null,null,null,null,null,null,null,null,null,null,null,null,null,null,null,null,null,null,null,null,null,null,null,null,null,null,null,null,null,null,167,"Tevin Coleman","SFO",29,"RB",5,0,12,26,1,2,14,2.2000000000000002,5.2,0,null,168,"Eno Benjamin","3TM",23,null,15,3,34,25,0.73499999999999999,193,7.7,0,10,22,5.7,1.7,12.9,0]
[null,null,null,null,null,null,null,null,null,null,null,null,null,null,null,null,null,null,null,null,null,null,null,null,null,null,null,null,null,null,null,null,null,null,null,null,168,"Snoop Conner","JAX",22,"RB",8,0,12,42,1,2,8,3.5,5.3,0,null,169,"Melvin Gordon","DEN",29,"RB",10,6,32,25,0.78100000000000003,223,8.9,0,11,24,7,2.5,22.3,5]
[null,null,null,null,null,null,null,null,null,null,null,null,null,null,null,null,null,null,null,null,null,null,null,null,null,null,null,null,null,null,null,null,null,null,null,null,169,"Devin Duvernay","BAL",25,"WR",14,13,12,84,1,7,18,7,6,1,null,170,"Mecole Hardman","KAN",24,"WR",8,5,34,25,0.73499999999999999,297,11.9,4,14,36,8.6999999999999993,3.1,37.1,1]
[null,null,null,null,null,null,null,null,null,null,null,null,null,null,null,null,null,null,null,null,null,null,null,null,null,null,null,null,null,null,null,null,null,null,null,null,170,"David Johnson","NOR",31,"RB",5,0,12,24,0,0,5,2,4.8,1,null,171,"Jarvis Landry","NOR",30,"WR",9,3,39,25,0.64100000000000001,272,10.9,1,12,40,7,2.8,30.2,1]
[null,null,null,null,null,null,null,null,null,null,null,null,null,null,null,null,null,null,null,null,null,null,null,null,null,null,null,null,null,null,null,null,null,null,null,null,171,"Dwayne Washington","NOR",28,"RB",12,0,11,38,0,2,8,3.5,3.2,0,null,172,"Colby Parkinson","SEA",23,"TE",17,2,34,25,0.73499999999999999,322,12.9,2,14,39,9.5,1.5,18.899999999999999,0]
[null,null,null,null,null,null,null,null,null,null,null,null,null,null,null,null,null,null,null,null,null,null,null,null,null,null,null,null,null,null,null,null,null,null,null,null,172,"Myles Gaskin","MIA",25,"RB",4,0,10,26,0,2,10,2.6,6.5,0,null,173,"Irv Smith Jr.","MIN",24,"TE",8,1,36,25,0.69399999999999995,182,7.3,2,9,17,5.0999999999999996,3.1,22.8,1]
[null,null,null,null,null,null,null,null,null,null,null,null,null,null,null,null,null,null,null,null,null,null,null,null,null,null,null,null,null,null,null,null,null,null,null,null,173,"Tony Jones","2TM",25,"RB",6,0,10,24,0,3,7,2.4,4,0,null,174,"Nick Westbrook-Ikhine","TEN",25,"WR",17,13,50,25,0.5,397,15.9,3,18,63,7.9,1.5,23.4,0]
[null,null,null,null,null,null,null,null,null,null,null,null,null,null,null,null,null,null,null,null,null,null,null,null,null,null,null,null,null,null,null,null,null,null,null,null,174,"CeeDee Lamb","DAL",23,"WR",17,17,10,47,0,3,14,4.7,2.8,0,null,175,"Jelani Woods","IND",24,"TE",15,2,40,25,0.625,312,12.5,3,16,36,7.8,1.7,20.8,1]
[null,null,null,null,null,null,null,null,null,null,null,null,null,null,null,null,null,null,null,null,null,null,null,null,null,null,null,null,null,null,null,null,null,null,null,null,175,"D.J. Moore","CAR",25,"WR",17,17,10,53,0,3,11,5.3,3.1,0,null,176,"David Bell","CLE",22,"WR",16,3,35,24,0.68600000000000005,214,8.9,0,7,20,6.1,1.5,13.4,0]
[null,null,null,null,null,null,null,null,null,null,null,null,null,null,null,null,null,null,null,null,null,null,null,null,null,null,null,null,null,null,null,null,null,null,null,null,176,"Pierre Strong","NWE",24,"RB",15,0,10,100,1,5,44,10,6.7,0,null,177,"A.J. Green","ARI",34,"WR",15,10,47,24,0.51100000000000001,236,9.8000000000000007,2,11,77,5,1.6,15.7,0]
[null,null,null,null,null,null,null,null,null,null,null,null,null,null,null,null,null,null,null,null,null,null,null,null,null,null,null,null,null,null,null,null,null,null,null,null,177,"J.J. Taylor","NWE",24,"RB",1,0,10,9,0,0,5,0.9,9,0,null,178,"Kendall Hinton","DEN",25,"WR",12,5,33,24,0.72699999999999998,311,13,0,14,35,9.4,2,25.9,0]
[null,null,null,null,null,null,null,null,null,null,null,null,null,null,null,null,null,null,null,null,null,null,null,null,null,null,null,null,null,null,null,null,null,null,null,null,178,"Patrick Taylor","GNB",24,"RB",14,0,10,31,0,2,6,3.1,2.2000000000000002,0,null,179,"Van Jefferson","LAR",26,"WR",11,9,44,24,0.54500000000000004,369,15.4,3,20,39,8.4,2.2000000000000002,33.5,0]
[null,null,null,null,null,null,null,null,null,null,null,null,null,null,null,null,null,null,null,null,null,null,null,null,null,null,null,null,null,null,null,null,null,null,null,null,179,"Bailey Zappe","NWE",23,"QB",4,2,10,0,0,0,5,0,0,4,null,"Rk","Player","Tm","Age","Pos","G","GS","Tgt","Rec","Ctch%","Yds","Y/R","TD","1D","Lng","Y/Tgt","R/G","Y/G","Fmb"]
[null,null,null,null,null,null,null,null,null,null,null,null,null,null,null,null,null,null,null,null,null,null,null,null,null,null,null,null,null,null,null,null,null,null,null,null,"Rk","Player","Tm","Age","Pos","G","GS","Att","Yds","TD","1D","Lng","Y/A","Y/G","Fmb",null,180,"Julio Jones","TAM",33,"WR",10,5,43,24,0.55800000000000005,299,12.5,2,13,48,7,2.4,29.9,0]
[null,null,null,null,null,null,null,null,null,null,null,null,null,null,null,null,null,null,null,null,null,null,null,null,null,null,null,null,null,null,null,null,null,null,null,null,180,"Tutu Atwell","LAR",23,"WR",13,4,9,34,1,2,11,3.8,2.6,0,null,181,"Brandon Powell","LAR",27,"WR",17,6,32,24,0.75,156,6.5,0,7,16,4.9000000000000004,1.4,9.1999999999999993,1]
[null,null,null,null,null,null,null,null,null,null,null,null,null,null,null,null,null,null,null,null,null,null,null,null,null,null,null,null,null,null,null,null,null,null,null,null,181,"Braxton Berrios","NYJ",27,"WR",17,2,9,91,2,5,25,10.1,5.4,1,null,182,"Jamal Agnew","JAX",27,"WR",15,0,30,23,0.76700000000000002,187,8.1,3,9,24,6.2,1.5,12.5,0]
[null,null,null,null,null,null,null,null,null,null,null,null,null,null,null,null,null,null,null,null,null,null,null,null,null,null,null,null,null,null,null,null,null,null,null,null,182,"Spencer Brown","CAR",24,"RB",2,0,9,43,0,1,7,4.8,21.5,0,null,183,"Kenneth Gainwell","PHI",23,"RB",17,0,29,23,0.79300000000000004,169,7.3,0,7,20,5.8,1.4,9.9,0]
[null,null,null,null,null,null,null,null,null,null,null,null,null,null,null,null,null,null,null,null,null,null,null,null,null,null,null,null,null,null,null,null,null,null,null,null,183,"Julius Chestnut","TEN",22,"RB",6,0,9,12,0,1,5,1.3,2,0,null,184,"Scott Miller","TAM",25,"WR",15,1,40,23,0.57499999999999996,185,8,0,8,23,4.5999999999999996,1.5,12.3,0]
[null,null,null,null,null,null,null,null,null,null,null,null,null,null,null,null,null,null,null,null,null,null,null,null,null,null,null,null,null,null,null,null,null,null,null,null,184,"Chase Claypool","2TM",24,"WR",15,11,9,59,0,3,15,6.6,3.9,1,null,185,"Wan'Dale Robinson","NYG",21,"WR",6,3,31,23,0.74199999999999999,227,9.9,1,13,19,7.3,3.8,37.799999999999997,0]
[null,null,null,null,null,null,null,null,null,null,null,null,null,null,null,null,null,null,null,null,null,null,null,null,null,null,null,null,null,null,null,null,null,null,null,null,185,"Velus Jones Jr.","CHI",25,"WR",12,2,9,103,1,5,42,11.4,8.6,3,null,186,"Skyy Moore","KAN",22,"WR",16,3,33,22,0.66700000000000004,250,11.4,0,13,30,7.6,1.4,15.6,3]
[null,null,null,null,null,null,null,null,null,null,null,null,null,null,null,null,null,null,null,null,null,null,null,null,null,null,null,null,null,null,null,null,null,null,null,null,186,"Cooper Kupp","LAR",29,"WR",9,9,9,52,1,4,20,5.8,5.8,2,null,187,"Shi Smith","CAR",24,"WR",17,6,41,22,0.53700000000000003,296,13.5,2,14,38,7.2,1.3,17.399999999999999,4]
[null,null,null,null,null,null,null,null,null,null,null,null,null,null,null,null,null,null,null,null,null,null,null,null,null,null,null,null,null,null,null,null,null,null,null,null,187,"Isaiah McKenzie","BUF",27,"WR",15,8,9,55,1,3,18,6.1,3.7,0,null,188,"Tyquan Thornton","NWE",22,"WR",13,9,45,22,0.48899999999999999,247,11.2,2,13,29,5.5,1.7,19,0]
[null,null,null,null,null,null,null,null,null,null,null,null,null,null,null,null,null,null,null,null,null,null,null,null,null,null,null,null,null,null,null,null,null,null,null,null,188,"Kene Nwangwu","MIN",24,"RB",17,0,9,14,0,1,8,1.6,0.8,0,null,189,"Jeff Wilson","2TM",27,"RB",16,7,37,22,0.59499999999999997,185,8.4,1,7,16,5,1.4,11.6,3]
[null,null,null,null,null,null,null,null,null,null,null,null,null,null,null,null,null,null,null,null,null,null,null,null,null,null,null,null,null,null,null,null,null,null,null,null,189,"Ronnie Rivers","LAR",23,"RB",8,1,9,21,0,1,5,2.2999999999999998,2.6,0,null,190,"James Cook","BUF",23,"RB",16,0,32,21,0.65600000000000003,180,8.6,1,5,41,5.6,1.3,11.3,1]
[null,null,null,null,null,null,null,null,null,null,null,null,null,null,null,null,null,null,null,null,null,null,null,null,null,null,null,null,null,null,null,null,null,null,null,null,190,"Cooper Rush","DAL",29,"QB",9,5,9,6,0,1,6,0.7,0.7,2,null,191,"Dontrell Hilliard","TEN",27,"RB",12,1,26,21,0.80800000000000005,177,8.4,4,8,31,6.8,1.8,14.8,0]
[null,null,null,null,null,null,null,null,null,null,null,null,null,null,null,null,null,null,null,null,null,null,null,null,null,null,null,null,null,null,null,null,null,null,null,null,191,"Laviska Shenault Jr.","CAR",24,"WR",13,4,9,65,1,1,41,7.2,5,0,null,192,"Cordarrelle Patterson","ATL",31,"RB",13,11,31,21,0.67700000000000005,122,5.8,0,6,16,3.9,1.6,9.4,1]
[null,null,null,null,null,null,null,null,null,null,null,null,null,null,null,null,null,null,null,null,null,null,null,null,null,null,null,null,null,null,null,null,null,null,null,null,192,"Amon-Ra St. Brown","DET",23,"WR",16,16,9,95,0,3,58,10.6,5.9,0,null,193,"Equanimeous St. Brown","CHI",26,"WR",16,16,38,21,0.55300000000000005,323,15.4,1,14,56,8.5,1.3,20.2,1]
[null,null,null,null,null,null,null,null,null,null,null,null,null,null,null,null,null,null,null,null,null,null,null,null,null,null,null,null,null,null,null,null,null,null,null,null,193,"Chris Streveler","NYJ",27,"QB",2,1,9,54,0,1,14,6,27,1,null,194,"Ian Thomas","CAR",26,"TE",17,17,30,21,0.7,197,9.4,0,8,50,6.6,1.2,11.6,0]
[null,null,null,null,null,null,null,null,null,null,null,null,null,null,null,null,null,null,null,null,null,null,null,null,null,null,null,null,null,null,null,null,null,null,null,null,194,"Derek Watt","PIT",30,"FB",17,3,9,21,1,8,4,2.2999999999999998,1.2,0,null,195,"C.J. Uzomah","NYJ",29,"TE",15,13,27,21,0.77800000000000002,232,11,2,10,40,8.6,1.4,15.5,0]
[null,null,null,null,null,null,null,null,null,null,null,null,null,null,null,null,null,null,null,null,null,null,null,null,null,null,null,null,null,null,null,null,null,null,null,null,195,"Giovani Bernard","TAM",31,"RB",8,0,8,28,0,0,8,3.5,3.5,1,null,196,"Chosen Anderson","2TM",29,"WR",16,7,44,20,0.45500000000000002,282,14.1,1,10,75,6.4,1.3,17.600000000000001,1]
[null,null,null,null,null,null,null,null,null,null,null,null,null,null,null,null,null,null,null,null,null,null,null,null,null,null,null,null,null,null,null,null,null,null,null,null,196,"Mike Davis","BAL",29,"RB",8,0,8,18,0,1,10,2.2999999999999998,2.2999999999999998,1,null,197,"Cameron Brate","TAM",31,"TE",11,1,38,20,0.52600000000000002,174,8.6999999999999993,0,8,21,4.5999999999999996,1.8,15.8,0]
[null,null,null,null,null,null,null,null,null,null,null,null,null,null,null,null,null,null,null,null,null,null,null,null,null,null,null,null,null,null,null,null,null,null,null,null,197,"Joshua Dobbs","TEN",27,"QB",2,2,8,44,0,4,11,5.5,22,4,null,198,"Matt Breida","NYG",27,"RB",17,1,25,20,0.8,118,5.9,0,5,16,4.7,1.2,6.9,0]
[null,null,null,null,null,null,null,null,null,null,null,null,null,null,null,null,null,null,null,null,null,null,null,null,null,null,null,null,null,null,null,null,null,null,null,null,198,"Jerome Ford","CLE",23,"RB",13,0,8,12,0,1,9,1.5,0.9,0,null,199,"Phillip Dorsett","HOU",29,"WR",15,4,40,20,0.5,257,12.9,1,11,34,6.4,1.3,17.100000000000001,0]
[null,null,null,null,null,null,null,null,null,null,null,null,null,null,null,null,null,null,null,null,null,null,null,null,null,null,null,null,null,null,null,null,null,null,null,null,199,"Gunner Olszewski","PIT",26,"WR",16,2,8,39,0,3,18,4.9000000000000004,2.4,2,null,200,"Jamycal Hasty","JAX",26,"RB",17,0,26,20,0.76900000000000002,126,6.3,1,7,28,4.8,1.2,7.4,0]
[null,null,null,null,null,null,null,null,null,null,null,null,null,null,null,null,null,null,null,null,null,null,null,null,null,null,null,null,null,null,null,null,null,null,null,null,200,"John Wolford","LAR",27,"QB",3,3,8,32,0,2,14,4,10.7,3,null,201,"Dare Ogunbowale","HOU",28,"RB",17,4,26,20,0.76900000000000002,104,5.2,0,5,23,4,1.2,6.1,0]
[null,null,null,null,null,null,null,null,null,null,null,null,null,null,null,null,null,null,null,null,null,null,null,null,null,null,null,null,null,null,null,null,null,null,null,null,201,"Greg Dortch","ARI",24,"WR",16,4,7,44,0,3,20,6.3,2.8,1,null,202,"Miles Sanders","PHI",25,"RB",17,15,26,20,0.76900000000000002,78,3.9,0,2,16,3,1.2,4.5999999999999996,2]
[null,null,null,null,null,null,null,null,null,null,null,null,null,null,null,null,null,null,null,null,null,null,null,null,null,null,null,null,null,null,null,null,null,null,null,null,202,"Tyreek Hill","MIA",28,"WR",17,17,7,32,1,3,10,4.5999999999999996,1.9,1,null,203,"Mo Alie-Cox","IND",29,"TE",17,11,28,19,0.67900000000000005,189,9.9,3,9,34,6.8,1.1000000000000001,11.1,1]
[null,null,null,null,null,null,null,null,null,null,null,null,null,null,null,null,null,null,null,null,null,null,null,null,null,null,null,null,null,null,null,null,null,null,null,null,203,"Diontae Johnson","PIT",26,"WR",17,17,7,25,0,1,8,3.6,1.5,1,null,204,"Jake Ferguson","DAL",23,"TE",16,8,22,19,0.86399999999999999,174,9.1999999999999993,2,8,30,7.9,1.2,10.9,0]
[null,null,null,null,null,null,null,null,null,null,null,null,null,null,null,null,null,null,null,null,null,null,null,null,null,null,null,null,null,null,null,null,null,null,null,null,204,"Kyle Juszczyk","SFO",31,"FB",16,12,7,26,1,5,9,3.7,1.6,0,null,205,"Zach Gentry","PIT",26,"TE",17,13,23,19,0.82599999999999996,132,6.9,0,6,32,5.7,1.1000000000000001,7.8,0]
[null,null,null,null,null,null,null,null,null,null,null,null,null,null,null,null,null,null,null,null,null,null,null,null,null,null,null,null,null,null,null,null,null,null,null,null,205,"Terry McLaurin","WAS",27,"WR",17,17,7,29,0,2,12,4.0999999999999996,1.7,1,null,206,"Breece Hall","NYJ",21,"RB",7,2,31,19,0.61299999999999999,218,11.5,1,8,79,7,2.7,31.1,1]
[null,null,null,null,null,null,null,null,null,null,null,null,null,null,null,null,null,null,null,null,null,null,null,null,null,null,null,null,null,null,null,null,null,null,null,null,206,"Gardner Minshew II","PHI",26,"QB",5,2,7,3,1,1,3,0.4,0.6,4,null,207,"Kyle Juszczyk","SFO",31,"FB",16,12,23,19,0.82599999999999996,200,10.5,1,9,35,8.6999999999999993,1.2,12.5,0]
[null,null,null,null,null,null,null,null,null,null,null,null,null,null,null,null,null,null,null,null,null,null,null,null,null,null,null,null,null,null,null,null,null,null,null,null,207,"Kalif Raymond","DET",28,"WR",17,7,7,36,0,4,12,5.0999999999999996,2.1,3,null,208,"Johnny Mundt","MIN",28,"TE",17,12,21,19,0.90500000000000003,140,7.4,1,9,17,6.7,1.1000000000000001,8.1999999999999993,0]
[null,null,null,null,null,null,null,null,null,null,null,null,null,null,null,null,null,null,null,null,null,null,null,null,null,null,null,null,null,null,null,null,null,null,null,null,208,"Patrick Ricard","BAL",28,"FB",17,16,7,16,0,5,5,2.2999999999999998,0.9,0,null,209,"Dante Pettis","CHI",27,"WR",17,7,41,19,0.46300000000000002,245,12.9,3,9,51,6,1.1000000000000001,14.4,1]
[null,null,null,null,null,null,null,null,null,null,null,null,null,null,null,null,null,null,null,null,null,null,null,null,null,null,null,null,null,null,null,null,null,null,null,null,209,"Kadarius Toney","2TM",23,"WR",9,4,7,82,1,5,32,11.7,9.1,1,null,"Rk","Player","Tm","Age","Pos","G","GS","Tgt","Rec","Ctch%","Yds","Y/R","TD","1D","Lng","Y/Tgt","R/G","Y/G","Fmb"]
[null,null,null,null,null,null,null,null,null,null,null,null,null,null,null,null,null,null,null,null,null,null,null,null,null,null,null,null,null,null,null,null,null,null,null,null,"Rk","Player","Tm","Age","Pos","G","GS","Att","Yds","TD","1D","Lng","Y/A","Y/G","Fmb",null,210,"Tre'Quan Smith","NOR",26,"WR",15,6,27,19,0.70399999999999996,278,14.6,1,14,48,10.3,1.3,18.5,0]
[null,null,null,null,null,null,null,null,null,null,null,null,null,null,null,null,null,null,null,null,null,null,null,null,null,null,null,null,null,null,null,null,null,null,null,null,210,"Christian Watson","GNB",23,"WR",14,11,7,80,2,2,46,11.4,5.7,0,null,211,"Tommy Tremble","CAR",22,"TE",17,4,32,19,0.59399999999999997,174,9.1999999999999993,3,9,29,5.4,1.1000000000000001,10.199999999999999,1]
[null,null,null,null,null,null,null,null,null,null,null,null,null,null,null,null,null,null,null,null,null,null,null,null,null,null,null,null,null,null,null,null,null,null,null,null,211,"Kyle Allen","HOU",26,"QB",2,2,6,13,0,2,5,2.2000000000000002,6.5,4,null,212,"Tutu Atwell","LAR",23,"WR",13,4,35,18,0.51400000000000001,298,16.600000000000001,1,11,62,8.5,1.4,22.9,0]
[null,null,null,null,null,null,null,null,null,null,null,null,null,null,null,null,null,null,null,null,null,null,null,null,null,null,null,null,null,null,null,null,null,null,null,null,212,"Kendrick Bourne","NWE",27,"WR",16,2,6,39,0,2,29,6.5,2.4,2,null,213,"Braxton Berrios","NYJ",27,"WR",17,2,32,18,0.56299999999999994,145,8.1,0,8,25,4.5,1.1000000000000001,8.5,1]
[null,null,null,null,null,null,null,null,null,null,null,null,null,null,null,null,null,null,null,null,null,null,null,null,null,null,null,null,null,null,null,null,null,null,null,null,213,"Ty Chandler","MIN",24,"RB",3,0,6,20,0,1,10,3.3,6.7,0,null,214,"Adam Trautman","NOR",25,"TE",15,12,22,18,0.81799999999999995,207,11.5,1,9,22,9.4,1.2,13.8,0]
[null,null,null,null,null,null,null,null,null,null,null,null,null,null,null,null,null,null,null,null,null,null,null,null,null,null,null,null,null,null,null,null,null,null,null,null,214,"Alec Ingold","MIA",26,"FB",17,14,6,8,1,5,2,1.3,0.5,0,null,215,"Brock Wright","DET",24,"TE",17,10,24,18,0.75,216,12,4,13,51,9,1.1000000000000001,12.7,0]
[null,null,null,null,null,null,null,null,null,null,null,null,null,null,null,null,null,null,null,null,null,null,null,null,null,null,null,null,null,null,null,null,null,null,null,null,215,"Anthony McFarland Jr.","PIT",23,"RB",1,0,6,30,0,3,14,5,30,0,null,216,"DeeJay Dallas","SEA",24,"RB",15,0,19,17,0.89500000000000002,126,7.4,0,5,41,6.6,1.1000000000000001,8.4,1]
[null,null,null,null,null,null,null,null,null,null,null,null,null,null,null,null,null,null,null,null,null,null,null,null,null,null,null,null,null,null,null,null,null,null,null,null,216,"Rondale Moore","ARI",22,"WR",8,8,6,-5,0,1,9,-0.8,-0.6,0,null,217,"Kenyan Drake","BAL",28,"RB",12,5,26,17,0.65400000000000003,89,5.2,1,7,15,3.4,1.4,7.4,1]
[null,null,null,null,null,null,null,null,null,null,null,null,null,null,null,null,null,null,null,null,null,null,null,null,null,null,null,null,null,null,null,null,null,null,null,null,217,"Brett Rypien","DEN",26,"QB",4,2,6,7,0,2,6,1.2,1.8,4,null,218,"Clyde Edwards-Helaire","KAN",23,"RB",10,6,23,17,0.73899999999999999,151,8.9,3,11,25,6.6,1.7,15.1,0]
[null,null,null,null,null,null,null,null,null,null,null,null,null,null,null,null,null,null,null,null,null,null,null,null,null,null,null,null,null,null,null,null,null,null,null,null,218,"Equanimeous St. Brown","CHI",26,"WR",16,16,6,54,0,2,41,9,3.4,1,null,219,"Ezekiel Elliott","DAL",27,"RB",15,14,23,17,0.73899999999999999,92,5.4,0,4,31,4,1.1000000000000001,6.1,0]
[null,null,null,null,null,null,null,null,null,null,null,null,null,null,null,null,null,null,null,null,null,null,null,null,null,null,null,null,null,null,null,null,null,null,null,null,219,"P.J. Walker","CAR",27,"QB",6,5,6,39,0,3,20,6.5,6.5,0,null,220,"Damien Harris","NWE",25,"RB",11,9,23,17,0.73899999999999999,97,5.7,0,4,15,4.2,1.5,8.8000000000000007,0]
[null,null,null,null,null,null,null,null,null,null,null,null,null,null,null,null,null,null,null,null,null,null,null,null,null,null,null,null,null,null,null,null,null,null,null,null,220,"Davis Webb","NYG",27,"QB",1,1,6,41,1,2,14,6.8,41,0,null,221,"Darrell Henderson","LAR",25,"RB",10,7,22,17,0.77300000000000002,102,6,0,5,15,4.5999999999999996,1.7,10.199999999999999,0]
[null,null,null,null,null,null,null,null,null,null,null,null,null,null,null,null,null,null,null,null,null,null,null,null,null,null,null,null,null,null,null,null,null,null,null,null,221,"Mike White","NYJ",27,"QB",4,4,6,9,1,3,4,1.5,2.2999999999999998,2,null,222,"Mitchell Wilcox","CIN",26,"TE",16,4,18,17,0.94399999999999995,139,8.1999999999999993,1,6,19,7.7,1.1000000000000001,8.6999999999999993,0]
[null,null,null,null,null,null,null,null,null,null,null,null,null,null,null,null,null,null,null,null,null,null,null,null,null,null,null,null,null,null,null,null,null,null,null,null,222,"Trayveon Williams","CIN",25,"RB",8,0,6,30,0,1,16,5,3.8,0,null,223,"Tyler Allgeier","ATL",22,"RB",16,7,17,16,0.94099999999999995,139,8.6999999999999993,1,8,26,8.1999999999999993,1,8.6999999999999993,0]
[null,null,null,null,null,null,null,null,null,null,null,null,null,null,null,null,null,null,null,null,null,null,null,null,null,null,null,null,null,null,null,null,null,null,null,null,223,"Michael Burton","KAN",30,"FB",17,0,5,7,0,2,6,1.4,0.4,0,null,224,"Marquez Callaway","NOR",24,"WR",14,3,32,16,0.5,158,9.9,1,11,33,4.9000000000000004,1.1000000000000001,11.3,0]
[null,null,null,null,null,null,null,null,null,null,null,null,null,null,null,null,null,null,null,null,null,null,null,null,null,null,null,null,null,null,null,null,null,null,null,null,224,"Parris Campbell","IND",25,"WR",17,16,5,58,0,2,28,11.6,3.4,1,null,225,"Chase Edmonds","2TM",26,"RB",13,3,24,16,0.66700000000000004,157,9.8000000000000007,1,7,27,6.5,1.2,12.1,0]
[null,null,null,null,null,null,null,null,null,null,null,null,null,null,null,null,null,null,null,null,null,null,null,null,null,null,null,null,null,null,null,null,null,null,null,null,225,"Ja'Marr Chase","CIN",22,"WR",12,12,5,8,0,0,6,1.6,0.7,2,null,226,"Travis Homer","SEA",24,"RB",10,1,18,16,0.88900000000000001,157,9.8000000000000007,1,7,27,8.6999999999999993,1.6,15.7,1]
[null,null,null,null,null,null,null,null,null,null,null,null,null,null,null,null,null,null,null,null,null,null,null,null,null,null,null,null,null,null,null,null,null,null,null,null,226,"Chad Henne","KAN",37,"QB",3,0,5,-5,0,0,-1,-1,-1.7,1,null,227,"Mark Ingram","NOR",33,"RB",10,3,18,16,0.88900000000000001,68,4.3,0,2,11,3.8,1.6,6.8,2]
[null,null,null,null,null,null,null,null,null,null,null,null,null,null,null,null,null,null,null,null,null,null,null,null,null,null,null,null,null,null,null,null,null,null,null,null,227,"Sam Howell","WAS",22,"QB",1,1,5,35,1,4,10,7,35,0,null,228,"MyCole Pruitt","ATL",30,"TE",13,4,21,16,0.76200000000000001,150,9.4,4,10,29,7.1,1.2,11.5,0]
[null,null,null,null,null,null,null,null,null,null,null,null,null,null,null,null,null,null,null,null,null,null,null,null,null,null,null,null,null,null,null,null,null,null,null,null,228,"Julio Jones","TAM",33,"WR",10,5,5,45,0,4,15,9,4.5,0,null,229,"Amari Rodgers","2TM",23,null,16,1,25,16,0.64,204,12.8,1,12,37,8.1999999999999993,1,12.8,6]
[null,null,null,null,null,null,null,null,null,null,null,null,null,null,null,null,null,null,null,null,null,null,null,null,null,null,null,null,null,null,null,null,null,null,null,null,229,"Case Keenum","BUF",34,"QB",2,0,5,0,0,0,4,0,0,0,null,230,"Michael Thomas","NOR",29,"WR",3,3,22,16,0.72699999999999998,171,10.7,3,13,21,7.8,5.3,57,0]
[null,null,null,null,null,null,null,null,null,null,null,null,null,null,null,null,null,null,null,null,null,null,null,null,null,null,null,null,null,null,null,null,null,null,null,null,230,"Christian Kirk","JAX",26,"WR",17,17,5,11,0,0,5,2.2000000000000002,0.6,1,null,231,"Kadarius Toney","2TM",23,"WR",9,4,20,16,0.8,171,10.7,2,8,38,8.6,1.8,19,1]
[null,null,null,null,null,null,null,null,null,null,null,null,null,null,null,null,null,null,null,null,null,null,null,null,null,null,null,null,null,null,null,null,null,null,null,null,231,"Elijah Moore","NYJ",22,"WR",16,9,5,5,0,2,10,1,0.3,1,null,232,"Sammy Watkins","2TM",29,null,12,5,27,16,0.59299999999999997,325,20.3,0,11,55,12,1.3,27.1,1]
[null,null,null,null,null,null,null,null,null,null,null,null,null,null,null,null,null,null,null,null,null,null,null,null,null,null,null,null,null,null,null,null,null,null,null,null,232,"Nate Sudfeld","DET",29,"QB",2,0,5,-4,0,0,0,-0.8,-2,0,null,233,"Javonte Williams","DEN",22,"RB",4,4,22,16,0.72699999999999998,76,4.8,0,4,13,3.5,4,19,1]
[null,null,null,null,null,null,null,null,null,null,null,null,null,null,null,null,null,null,null,null,null,null,null,null,null,null,null,null,null,null,null,null,null,null,null,null,233,"Tyrod Taylor","NYG",33,"QB",3,0,5,70,0,5,32,14,23.3,2,null,234,"Rashod Bateman","BAL",23,"WR",6,5,28,15,0.53600000000000003,285,19,2,7,75,10.199999999999999,2.5,47.5,1]
[null,null,null,null,null,null,null,null,null,null,null,null,null,null,null,null,null,null,null,null,null,null,null,null,null,null,null,null,null,null,null,null,null,null,null,null,234,"Jonathan Ward","2TM",25,null,8,0,5,25,0,2,12,5,3.1,0,null,235,"Ashton Dulin","IND",25,"WR",12,2,22,15,0.68200000000000005,207,13.8,1,12,39,9.4,1.3,17.3,0]
[null,null,null,null,null,null,null,null,null,null,null,null,null,null,null,null,null,null,null,null,null,null,null,null,null,null,null,null,null,null,null,null,null,null,null,null,235,"Montrell Washington","DEN",23,"WR",15,1,5,30,0,0,19,6,2,5,null,236,"Alec Ingold","MIA",26,"FB",17,14,23,15,0.65200000000000002,105,7,1,4,17,4.5999999999999996,0.9,6.2,0]
[null,null,null,null,null,null,null,null,null,null,null,null,null,null,null,null,null,null,null,null,null,null,null,null,null,null,null,null,null,null,null,null,null,null,null,null,236,"Jameis Winston","NOR",28,"QB",3,3,5,16,0,0,6,3.2,5.3,3,null,237,"Trenton Irwin","CIN",27,"WR",9,2,23,15,0.65200000000000002,231,15.4,4,12,45,10,1.7,25.7,0]
[null,null,null,null,null,null,null,null,null,null,null,null,null,null,null,null,null,null,null,null,null,null,null,null,null,null,null,null,null,null,null,null,null,null,null,null,237,"Ameer Abdullah","LVR",29,"RB",17,0,4,20,0,2,7,5,1.2,0,null,238,"Alexander Mattison","MIN",24,"RB",17,0,18,15,0.83299999999999996,91,6.1,1,4,16,5.0999999999999996,0.9,5.4,0]
[null,null,null,null,null,null,null,null,null,null,null,null,null,null,null,null,null,null,null,null,null,null,null,null,null,null,null,null,null,null,null,null,null,null,null,null,238,"C.J. Beathard","JAX",29,"QB",4,0,4,-4,0,0,-1,-1,-1,0,null,239,"Zach Pascal","PHI",28,"WR",17,2,19,15,0.78900000000000003,150,10,1,9,34,7.9,0.9,8.8000000000000007,0]
[null,null,null,null,null,null,null,null,null,null,null,null,null,null,null,null,null,null,null,null,null,null,null,null,null,null,null,null,null,null,null,null,null,null,null,null,239,"David Blough","ARI",27,"QB",2,2,4,5,0,0,4,1.3,2.5,1,null,"Rk","Player","Tm","Age","Pos","G","GS","Tgt","Rec","Ctch%","Yds","Y/R","TD","1D","Lng","Y/Tgt","R/G","Y/G","Fmb"]
[null,null,null,null,null,null,null,null,null,null,null,null,null,null,null,null,null,null,null,null,null,null,null,null,null,null,null,null,null,null,null,null,null,null,null,null,"Rk","Player","Tm","Age","Pos","G","GS","Att","Yds","TD","1D","Lng","Y/A","Y/G","Fmb",null,240,"Eric Saubert","DEN",28,"TE",17,6,24,15,0.625,148,9.9,1,6,25,6.2,0.9,8.6999999999999993,0]
[null,null,null,null,null,null,null,null,null,null,null,null,null,null,null,null,null,null,null,null,null,null,null,null,null,null,null,null,null,null,null,null,null,null,null,null,240,"Treylon Burks","TEN",22,"WR",11,6,4,47,0,3,20,11.8,4.3,0,null,241,"Durham Smythe","MIA",27,"TE",16,15,20,15,0.75,129,8.6,1,7,26,6.5,0.9,8.1,0]
[null,null,null,null,null,null,null,null,null,null,null,null,null,null,null,null,null,null,null,null,null,null,null,null,null,null,null,null,null,null,null,null,null,null,null,null,241,"Pharoh Cooper","ARI",27,"WR",5,1,4,15,0,0,6,3.8,3,0,null,242,"Justin Watson","KAN",26,"WR",17,5,34,15,0.441,315,21,2,12,67,9.3000000000000007,0.9,18.5,0]
[null,null,null,null,null,null,null,null,null,null,null,null,null,null,null,null,null,null,null,null,null,null,null,null,null,null,null,null,null,null,null,null,null,null,null,null,242,"C.J. Ham","MIN",29,"FB",17,4,4,7,2,3,3,1.8,0.4,0,null,243,"John Bates","WAS",25,"TE",16,7,22,14,0.63600000000000001,108,7.7,1,4,20,4.9000000000000004,0.9,6.8,1]
[null,null,null,null,null,null,null,null,null,null,null,null,null,null,null,null,null,null,null,null,null,null,null,null,null,null,null,null,null,null,null,null,null,null,null,null,243,"Mecole Hardman","KAN",24,"WR",8,5,4,31,2,3,25,7.8,3.9,1,null,244,"Chuba Hubbard","CAR",23,"RB",15,2,17,14,0.82399999999999995,171,12.2,0,5,45,10.1,0.9,11.4,2]
[null,null,null,null,null,null,null,null,null,null,null,null,null,null,null,null,null,null,null,null,null,null,null,null,null,null,null,null,null,null,null,null,null,null,null,null,244,"Mack Hollins","LVR",29,"WR",17,16,4,40,0,2,17,10,2.4,0,null,245,"Brevin Jordan","HOU",22,"TE",11,3,28,14,0.5,128,9.1,0,7,20,4.5999999999999996,1.3,11.6,0]
[null,null,null,null,null,null,null,null,null,null,null,null,null,null,null,null,null,null,null,null,null,null,null,null,null,null,null,null,null,null,null,null,null,null,null,null,245,"Zander Horvath","LAC",24,"FB",15,2,4,8,0,2,3,2,0.5,0,null,246,"Joshua Kelley","LAC",25,"RB",13,1,25,14,0.56000000000000005,101,7.2,0,4,22,4,1.1000000000000001,7.8,0]
[null,null,null,null,null,null,null,null,null,null,null,null,null,null,null,null,null,null,null,null,null,null,null,null,null,null,null,null,null,null,null,null,null,null,null,null,246,"Justin Jefferson","MIN",23,"WR",17,17,4,24,1,2,10,6,1.4,0,null,247,"Ray-Ray McCloud","SFO",26,"WR",17,2,25,14,0.56000000000000005,243,17.399999999999999,1,11,42,9.6999999999999993,0.8,14.3,2]
[null,null,null,null,null,null,null,null,null,null,null,null,null,null,null,null,null,null,null,null,null,null,null,null,null,null,null,null,null,null,null,null,null,null,null,null,247,"Jerry Jeudy","DEN",23,"WR",15,14,4,40,0,4,14,10,2.7,0,null,248,"Josh Oliver","BAL",25,"TE",17,9,25,14,0.56000000000000005,149,10.6,2,7,40,6,0.8,8.8000000000000007,0]
[null,null,null,null,null,null,null,null,null,null,null,null,null,null,null,null,null,null,null,null,null,null,null,null,null,null,null,null,null,null,null,null,null,null,null,null,248,"D'Ernest Johnson","CLE",26,"RB",15,0,4,17,0,1,7,4.3,1.1000000000000001,0,null,249,"Steven Sims","PIT",25,"WR",12,2,23,14,0.60899999999999999,104,7.4,0,5,28,4.5,1.2,8.6999999999999993,3]
[null,null,null,null,null,null,null,null,null,null,null,null,null,null,null,null,null,null,null,null,null,null,null,null,null,null,null,null,null,null,null,null,null,null,null,null,249,"Zay Jones","JAX",27,"WR",16,15,4,18,0,1,14,4.5,1.1000000000000001,0,null,250,"Cam Akers","LAR",23,"RB",15,9,18,13,0.72199999999999998,117,9,0,8,18,6.5,0.9,7.8,2]
[null,null,null,null,null,null,null,null,null,null,null,null,null,null,null,null,null,null,null,null,null,null,null,null,null,null,null,null,null,null,null,null,null,null,null,null,250,"Ray-Ray McCloud","SFO",26,"WR",17,2,4,78,1,1,71,19.5,4.5999999999999996,2,null,251,"Damiere Byrd","ATL",29,"WR",14,4,23,13,0.56499999999999995,268,20.6,2,9,75,11.7,0.9,19.100000000000001,0]
[null,null,null,null,null,null,null,null,null,null,null,null,null,null,null,null,null,null,null,null,null,null,null,null,null,null,null,null,null,null,null,null,null,null,null,null,251,"Nick Mullens","MIN",27,"QB",4,0,4,8,0,1,4,2,2,0,null,252,"Lawrence Cager","2TM",25,"TE",7,4,19,13,0.68400000000000005,118,9.1,1,8,20,6.2,1.9,16.899999999999999,0]
[null,null,null,null,null,null,null,null,null,null,null,null,null,null,null,null,null,null,null,null,null,null,null,null,null,null,null,null,null,null,null,null,null,null,null,null,252,"Adam Prentice","NOR",25,"FB",11,2,4,9,0,3,3,2.2999999999999998,0.8,1,null,253,"Josiah Deguara","GNB",25,"TE",17,3,15,13,0.86699999999999999,114,8.8000000000000007,0,4,25,7.6,0.8,6.7,0]
[null,null,null,null,null,null,null,null,null,null,null,null,null,null,null,null,null,null,null,null,null,null,null,null,null,null,null,null,null,null,null,null,null,null,null,null,253,"Jalen Reagor","MIN",23,"WR",17,0,4,25,0,1,17,6.3,1.5,4,null,254,"KhaDarel Hodge","ATL",27,"WR",17,1,20,13,0.65,202,15.5,1,7,39,10.1,0.8,11.9,0]
[null,null,null,null,null,null,null,null,null,null,null,null,null,null,null,null,null,null,null,null,null,null,null,null,null,null,null,null,null,null,null,null,null,null,null,null,254,"Anthony Schwartz","CLE",22,"WR",11,1,4,57,1,2,31,14.3,5.2,1,null,255,"Zonovan Knight","NYJ",21,"RB",7,4,14,13,0.92900000000000005,100,7.7,0,5,16,7.1,1.9,14.3,2]
[null,null,null,null,null,null,null,null,null,null,null,null,null,null,null,null,null,null,null,null,null,null,null,null,null,null,null,null,null,null,null,null,null,null,null,null,255,"Rashid Shaheed","NOR",24,"WR",12,6,4,57,1,2,44,14.3,4.8,1,null,256,"Isiah Pacheco","KAN",23,"RB",17,11,14,13,0.92900000000000005,130,10,0,7,32,9.3000000000000007,0.8,7.6,4]
[null,null,null,null,null,null,null,null,null,null,null,null,null,null,null,null,null,null,null,null,null,null,null,null,null,null,null,null,null,null,null,null,null,null,null,null,256,"Trevor Siemian","CHI",31,"QB",2,1,4,8,0,1,6,2,4,0,null,257,"Sterling Shepard","NYG",29,"WR",3,2,24,13,0.54200000000000004,154,11.8,1,4,65,6.4,4.3,51.3,0]
[null,null,null,null,null,null,null,null,null,null,null,null,null,null,null,null,null,null,null,null,null,null,null,null,null,null,null,null,null,null,null,null,null,null,null,null,257,"Trent Taylor","CIN",28,"WR",16,1,4,15,0,0,9,3.8,0.9,2,null,258,"Avery Williams","ATL",24,"RB",17,3,14,13,0.92900000000000005,61,4.7,0,3,10,4.4000000000000004,0.8,3.6,1]
[null,null,null,null,null,null,null,null,null,null,null,null,null,null,null,null,null,null,null,null,null,null,null,null,null,null,null,null,null,null,null,null,null,null,null,null,258,"DJ Turner","LVR",25,"WR",9,0,4,26,0,1,18,6.5,2.9,1,null,259,"Pharaoh Brown","2TM",28,"TE",16,8,20,12,0.6,117,9.8000000000000007,0,6,30,5.9,0.8,7.3,0]
[null,null,null,null,null,null,null,null,null,null,null,null,null,null,null,null,null,null,null,null,null,null,null,null,null,null,null,null,null,null,null,null,null,null,null,null,259,"Garrett Wilson","NYJ",22,"WR",17,12,4,4,0,0,7,1,0.2,2,null,260,"Connor Heyward","PIT",23,"TE",17,0,17,12,0.70599999999999996,151,12.6,1,6,45,8.9,0.7,8.9,0]
[null,null,null,null,null,null,null,null,null,null,null,null,null,null,null,null,null,null,null,null,null,null,null,null,null,null,null,null,null,null,null,null,null,null,null,null,260,"Davante Adams","LVR",30,"WR",17,17,3,-1,0,0,4,-0.3,-0.1,1,null,261,"Justice Hill","BAL",25,"RB",15,0,12,12,1,58,4.8,0,2,15,4.8,0.8,3.9,2]
[null,null,null,null,null,null,null,null,null,null,null,null,null,null,null,null,null,null,null,null,null,null,null,null,null,null,null,null,null,null,null,null,null,null,null,null,261,"Brandon Allen","CIN",30,"QB",1,0,3,-1,0,1,2,-0.3,-1,0,null,262,"Justin Jackson","DET",26,"RB",16,0,19,12,0.63200000000000001,101,8.4,1,7,15,5.3,0.8,6.3,0]
[null,null,null,null,null,null,null,null,null,null,null,null,null,null,null,null,null,null,null,null,null,null,null,null,null,null,null,null,null,null,null,null,null,null,null,null,262,"Mark Andrews","BAL",27,"TE",15,15,3,8,0,3,4,2.7,0.5,1,null,263,"Ty Johnson","NYJ",25,"RB",17,1,24,12,0.5,88,7.3,0,3,16,3.7,0.7,5.2,0]
[null,null,null,null,null,null,null,null,null,null,null,null,null,null,null,null,null,null,null,null,null,null,null,null,null,null,null,null,null,null,null,null,null,null,null,null,263,"Reggie Bonnafon","WAS",26,"RB",1,0,3,8,0,0,5,2.7,8,0,null,264,"Geoff Swaim","TEN",29,"TE",17,13,16,12,0.75,58,4.8,1,4,13,3.6,0.7,3.4,0]
[null,null,null,null,null,null,null,null,null,null,null,null,null,null,null,null,null,null,null,null,null,null,null,null,null,null,null,null,null,null,null,null,null,null,null,null,264,"Teddy Bridgewater","MIA",30,"QB",5,2,3,27,0,2,11,9,5.4,0,null,265,"Jamaal Williams","DET",27,"RB",17,9,16,12,0.75,73,6.1,0,4,17,4.5999999999999996,0.7,4.3,3]
[null,null,null,null,null,null,null,null,null,null,null,null,null,null,null,null,null,null,null,null,null,null,null,null,null,null,null,null,null,null,null,null,null,null,null,null,265,"Anthony Brown","BAL",24,"QB",2,1,3,-5,0,0,-1,-1.7,-2.5,1,null,266,"Cedrick Wilson Jr.","MIA",27,"WR",15,0,18,12,0.66700000000000004,136,11.3,0,8,21,7.6,0.8,9.1,0]
[null,null,null,null,null,null,null,null,null,null,null,null,null,null,null,null,null,null,null,null,null,null,null,null,null,null,null,null,null,null,null,null,null,null,null,null,266,"Joe Flacco","NYJ",37,"QB",5,4,3,6,0,1,7,2,1.2,5,null,267,"Hassan Haskins","TEN",23,"RB",15,1,12,11,0.91700000000000004,57,5.2,0,2,10,4.8,0.7,3.8,0]
[null,null,null,null,null,null,null,null,null,null,null,null,null,null,null,null,null,null,null,null,null,null,null,null,null,null,null,null,null,null,null,null,null,null,null,null,267,"Chris Godwin","TAM",26,"WR",15,13,3,5,0,0,2,1.7,0.3,2,null,268,"Peyton Hendershot","DAL",23,"TE",17,2,16,11,0.68799999999999994,103,9.4,2,8,29,6.4,0.6,6.1,1]
[null,null,null,null,null,null,null,null,null,null,null,null,null,null,null,null,null,null,null,null,null,null,null,null,null,null,null,null,null,null,null,null,null,null,null,null,268,"Godwin Igwebuike","SEA",28,"RB",5,0,3,4,0,0,4,1.3,0.8,0,null,269,"Denzel Mims","NYJ",25,"WR",10,4,25,11,0.44,186,16.899999999999999,0,7,63,7.4,1.1000000000000001,18.600000000000001,0]
[null,null,null,null,null,null,null,null,null,null,null,null,null,null,null,null,null,null,null,null,null,null,null,null,null,null,null,null,null,null,null,null,null,null,null,null,269,"Chris Moore","HOU",29,"WR",16,7,3,3,0,0,3,1,0.2,0,null,"Rk","Player","Tm","Age","Pos","G","GS","Tgt","Rec","Ctch%","Yds","Y/R","TD","1D","Lng","Y/Tgt","R/G","Y/G","Fmb"]
[null,null,null,null,null,null,null,null,null,null,null,null,null,null,null,null,null,null,null,null,null,null,null,null,null,null,null,null,null,null,null,null,null,null,null,null,"Rk","Player","Tm","Age","Pos","G","GS","Att","Yds","TD","1D","Lng","Y/A","Y/G","Fmb",null,270,"James Mitchell","DET",23,"TE",14,0,11,11,1,113,10.3,1,7,22,10.3,0.8,8.1,0]
[null,null,null,null,null,null,null,null,null,null,null,null,null,null,null,null,null,null,null,null,null,null,null,null,null,null,null,null,null,null,null,null,null,null,null,null,270,"Skyy Moore","KAN",22,"WR",16,3,3,24,0,1,12,8,1.5,3,null,271,"Zack Moss","2TM",25,"RB",13,3,13,11,0.84599999999999997,39,3.5,0,2,8,3,0.8,3,1]
[null,null,null,null,null,null,null,null,null,null,null,null,null,null,null,null,null,null,null,null,null,null,null,null,null,null,null,null,null,null,null,null,null,null,null,null,271,"Chigoziem Okonkwo","TEN",23,"TE",17,8,3,2,0,0,6,0.7,0.1,0,null,272,"Patrick Ricard","BAL",28,"FB",17,16,13,11,0.84599999999999997,74,6.7,0,1,19,5.7,0.6,4.4000000000000004,0]
[null,null,null,null,null,null,null,null,null,null,null,null,null,null,null,null,null,null,null,null,null,null,null,null,null,null,null,null,null,null,null,null,null,null,null,null,272,"K.J. Osborn","MIN",25,"WR",17,9,3,6,0,2,5,2,0.4,1,null,273,"James Robinson","2TM",24,"RB",11,5,14,11,0.78600000000000003,51,4.5999999999999996,2,5,10,3.6,1,4.5999999999999996,1]
[null,null,null,null,null,null,null,null,null,null,null,null,null,null,null,null,null,null,null,null,null,null,null,null,null,null,null,null,null,null,null,null,null,null,null,null,273,"Devine Ozigbo","DEN",26,"RB",4,0,3,4,0,0,4,1.3,1,0,null,274,"David Sills","NYG",26,"WR",9,5,17,11,0.64700000000000002,106,9.6,0,7,24,6.2,1.2,11.8,0]
[null,null,null,null,null,null,null,null,null,null,null,null,null,null,null,null,null,null,null,null,null,null,null,null,null,null,null,null,null,null,null,null,null,null,null,null,274,"George Pickens","PIT",21,"WR",17,12,3,24,1,2,22,8,1.4,0,null,275,"Jack Stoll","PHI",24,"TE",17,11,14,11,0.78600000000000003,123,11.2,0,5,26,8.8000000000000007,0.6,7.2,0]
[null,null,null,null,null,null,null,null,null,null,null,null,null,null,null,null,null,null,null,null,null,null,null,null,null,null,null,null,null,null,null,null,null,null,null,null,275,"Michael Pittman Jr.","IND",25,"WR",16,16,3,30,0,2,19,10,1.9,2,null,276,"Shane Zylstra","DET",26,"TE",13,2,15,11,0.73299999999999998,60,5.5,4,6,14,4,0.8,4.5999999999999996,0]
[null,null,null,null,null,null,null,null,null,null,null,null,null,null,null,null,null,null,null,null,null,null,null,null,null,null,null,null,null,null,null,null,null,null,null,null,276,"Tyquan Thornton","NWE",22,"WR",13,9,3,16,1,1,19,5.3,1.2,0,null,277,"Michael Bandy","LAC",25,"WR",10,2,21,10,0.47599999999999998,89,8.9,0,5,25,4.2,1,8.9,0]
[null,null,null,null,null,null,null,null,null,null,null,null,null,null,null,null,null,null,null,null,null,null,null,null,null,null,null,null,null,null,null,null,null,null,null,null,277,"KaVontae Turpin","DAL",26,"WR",17,0,3,17,0,1,11,5.7,1,3,null,278,"Raheem Blackshear","CAR",23,"RB",13,1,12,10,0.83299999999999996,93,9.3000000000000007,0,3,27,7.8,0.8,7.2,1]
[null,null,null,null,null,null,null,null,null,null,null,null,null,null,null,null,null,null,null,null,null,null,null,null,null,null,null,null,null,null,null,null,null,null,null,null,278,"Jaylen Waddle","MIA",24,"WR",17,17,3,26,0,0,9,8.6999999999999993,1.5,1,null,279,"Keelan Cole","LVR",29,"WR",14,3,21,10,0.47599999999999998,141,14.1,1,8,30,6.7,0.7,10.1,1]
[null,null,null,null,null,null,null,null,null,null,null,null,null,null,null,null,null,null,null,null,null,null,null,null,null,null,null,null,null,null,null,null,null,null,null,null,279,"Quez Watkins","PHI",24,"WR",17,8,3,1,0,0,4,0.3,0.1,1,null,280,"C.J. Ham","MIN",29,"FB",17,4,12,10,0.83299999999999996,86,8.6,0,7,17,7.2,0.6,5.0999999999999996,0]
[null,null,null,null,null,null,null,null,null,null,null,null,null,null,null,null,null,null,null,null,null,null,null,null,null,null,null,null,null,null,null,null,null,null,null,null,280,"Brandon Aiyuk","SFO",24,"WR",17,17,2,23,0,1,16,11.5,1.4,1,null,281,"O.J. Howard","HOU",28,"TE",13,10,23,10,0.435,145,14.5,2,6,26,6.3,0.8,11.2,0]
[null,null,null,null,null,null,null,null,null,null,null,null,null,null,null,null,null,null,null,null,null,null,null,null,null,null,null,null,null,null,null,null,null,null,null,null,281,"Andrew Beck","DEN",26,"FB",13,4,2,0,0,0,1,0,0,0,null,282,"Tanner Hudson","NYG",28,"TE",11,0,15,10,0.66700000000000004,132,13.2,0,8,27,8.8000000000000007,0.9,12,0]
[null,null,null,null,null,null,null,null,null,null,null,null,null,null,null,null,null,null,null,null,null,null,null,null,null,null,null,null,null,null,null,null,null,null,null,null,282,"Tim Boyle","CHI",28,"QB",1,0,2,-2,0,0,-1,-1,-2,0,null,283,"Tre' McKitty","LAC",23,"TE",17,8,18,10,0.55600000000000005,72,7.2,0,0,12,4,0.6,4.2,1]
[null,null,null,null,null,null,null,null,null,null,null,null,null,null,null,null,null,null,null,null,null,null,null,null,null,null,null,null,null,null,null,null,null,null,null,null,283,"DeAndre Carter","LAC",29,"WR",17,7,2,-15,0,0,-5,-7.5,-0.9,3,null,284,"Albert Okwuegbunam","DEN",24,"TE",8,1,18,10,0.55600000000000005,95,9.5,1,4,25,5.3,1.3,11.9,0]
[null,null,null,null,null,null,null,null,null,null,null,null,null,null,null,null,null,null,null,null,null,null,null,null,null,null,null,null,null,null,null,null,null,null,null,null,284,"Tyler Conklin","NYJ",27,"TE",17,16,2,3,0,2,2,1.5,0.2,2,null,285,"Donald Parham","LAC",25,"TE",6,1,12,10,0.83299999999999996,130,13,1,5,24,10.8,1.7,21.7,0]
[null,null,null,null,null,null,null,null,null,null,null,null,null,null,null,null,null,null,null,null,null,null,null,null,null,null,null,null,null,null,null,null,null,null,null,null,285,"Brandin Cooks","HOU",29,"WR",13,13,2,7,0,0,5,3.5,0.5,0,null,286,"Byron Pringle","CHI",29,"WR",11,4,16,10,0.625,135,13.5,2,8,35,8.4,0.9,12.3,0]
[null,null,null,null,null,null,null,null,null,null,null,null,null,null,null,null,null,null,null,null,null,null,null,null,null,null,null,null,null,null,null,null,null,null,null,null,286,"Michael Dickson","SEA",26,"P",17,0,2,-18,0,0,-8,-9,-1.1000000000000001,1,null,287,"Khalil Shakir","BUF",22,"WR",14,2,20,10,0.5,161,16.100000000000001,1,7,31,8.1,0.7,11.5,0]
[null,null,null,null,null,null,null,null,null,null,null,null,null,null,null,null,null,null,null,null,null,null,null,null,null,null,null,null,null,null,null,null,null,null,null,null,287,"Jahan Dotson","WAS",22,"WR",12,10,2,-7,0,0,3,-3.5,-0.6,0,null,288,"Dan Arnold","JAX",27,"TE",17,0,13,9,0.69199999999999995,135,15,0,5,26,10.4,0.5,7.9,0]
[null,null,null,null,null,null,null,null,null,null,null,null,null,null,null,null,null,null,null,null,null,null,null,null,null,null,null,null,null,null,null,null,null,null,null,null,288,"Ashton Dulin","IND",25,"WR",12,2,2,8,0,1,5,4,0.7,0,null,289,"Brandon Bolden","LVR",32,"RB",16,0,9,9,1,57,6.3,1,2,18,6.3,0.6,3.6,0]
[null,null,null,null,null,null,null,null,null,null,null,null,null,null,null,null,null,null,null,null,null,null,null,null,null,null,null,null,null,null,null,null,null,null,null,null,289,"Evan Engram","JAX",28,"TE",17,14,2,13,0,1,13,6.5,0.8,0,null,290,"Mike Boone","DEN",27,"RB",9,0,15,9,0.6,96,10.7,0,2,34,6.4,1,10.7,0]
[null,null,null,null,null,null,null,null,null,null,null,null,null,null,null,null,null,null,null,null,null,null,null,null,null,null,null,null,null,null,null,null,null,null,null,null,290,"D'Wayne Eskridge","SEA",25,"WR",10,0,2,10,0,0,6,5,1,0,null,291,"River Cracraft","MIA",28,"WR",11,0,14,9,0.64300000000000002,102,11.3,2,8,22,7.3,0.8,9.3000000000000007,0]
[null,null,null,null,null,null,null,null,null,null,null,null,null,null,null,null,null,null,null,null,null,null,null,null,null,null,null,null,null,null,null,null,null,null,null,null,291,"Nick Foles","IND",33,"QB",3,2,2,8,0,0,8,4,2.7,0,null,292,"Anthony Firkser","ATL",27,"TE",11,1,13,9,0.69199999999999995,100,11.1,0,5,22,7.7,0.8,9.1,0]
[null,null,null,null,null,null,null,null,null,null,null,null,null,null,null,null,null,null,null,null,null,null,null,null,null,null,null,null,null,null,null,null,null,null,null,null,292,"Jamie Gillan","NYG",25,"P",17,0,2,-3,0,0,0,-1.5,-0.2,1,null,293,"Jody Fortson","KAN",27,"TE",13,1,13,9,0.69199999999999995,108,12,2,6,40,8.3000000000000007,0.7,8.3000000000000007,1]
[null,null,null,null,null,null,null,null,null,null,null,null,null,null,null,null,null,null,null,null,null,null,null,null,null,null,null,null,null,null,null,null,null,null,null,null,293,"Marquise Goodwin","SEA",32,"WR",13,2,2,5,0,0,7,2.5,0.4,0,null,294,"Khalil Herbert","CHI",24,"RB",13,1,12,9,0.75,57,6.3,1,2,25,4.8,0.7,4.4000000000000004,0]
[null,null,null,null,null,null,null,null,null,null,null,null,null,null,null,null,null,null,null,null,null,null,null,null,null,null,null,null,null,null,null,null,null,null,null,null,294,"KJ Hamler","DEN",23,"WR",7,0,2,23,0,1,14,11.5,3.3,0,null,295,"Parker Hesse","ATL",27,"TE",17,7,11,9,0.81799999999999995,89,9.9,0,6,22,8.1,0.5,5.2,0]
[null,null,null,null,null,null,null,null,null,null,null,null,null,null,null,null,null,null,null,null,null,null,null,null,null,null,null,null,null,null,null,null,null,null,null,null,295,"Connor Heyward","PIT",23,"TE",17,0,2,27,0,2,21,13.5,1.6,0,null,296,"Taysom Hill","NOR",32,"TE",16,8,13,9,0.69199999999999995,77,8.6,2,5,30,5.9,0.6,4.8,2]
[null,null,null,null,null,null,null,null,null,null,null,null,null,null,null,null,null,null,null,null,null,null,null,null,null,null,null,null,null,null,null,null,null,null,null,null,296,"Kendall Hinton","DEN",25,"WR",12,5,2,13,0,1,13,6.5,1.1000000000000001,0,null,297,"DeSean Jackson","BAL",36,"WR",7,1,17,9,0.52900000000000003,153,17,0,5,62,9,1.3,21.9,0]
[null,null,null,null,null,null,null,null,null,null,null,null,null,null,null,null,null,null,null,null,null,null,null,null,null,null,null,null,null,null,null,null,null,null,null,null,297,"Richie James","NYG",27,"WR",17,4,2,6,0,0,4,3,0.4,3,null,298,"Marcus Johnson","NYG",28,"WR",14,7,22,9,0.40899999999999997,99,11,0,6,18,4.5,0.6,7.1,0]
[null,null,null,null,null,null,null,null,null,null,null,null,null,null,null,null,null,null,null,null,null,null,null,null,null,null,null,null,null,null,null,null,null,null,null,null,298,"Duke Johnson","BUF",29,"RB",1,0,2,4,0,1,4,2,4,0,null,299,"Sony Michel","LAC",27,"RB",10,0,13,9,0.69199999999999995,53,5.9,0,1,9,4.0999999999999996,0.9,5.3,0]
[null,null,null,null,null,null,null,null,null,null,null,null,null,null,null,null,null,null,null,null,null,null,null,null,null,null,null,null,null,null,null,null,null,null,null,null,299,"Josh Johnson","SFO",36,"QB",2,0,2,3,0,0,4,1.5,1.5,0,null,"Rk","Player","Tm","Age","Pos","G","GS","Tgt","Rec","Ctch%","Yds","Y/R","TD","1D","Lng","Y/Tgt","R/G","Y/G","Fmb"]
[null,null,null,null,null,null,null,null,null,null,null,null,null,null,null,null,null,null,null,null,null,null,null,null,null,null,null,null,null,null,null,null,null,null,null,null,"Rk","Player","Tm","Age","Pos","G","GS","Att","Yds","TD","1D","Lng","Y/A","Y/G","Fmb",null,300,"Jalen Nailor","MIN",23,"WR",15,0,13,9,0.69199999999999995,179,19.899999999999999,1,7,47,13.8,0.6,11.9,0]
[null,null,null,null,null,null,null,null,null,null,null,null,null,null,null,null,null,null,null,null,null,null,null,null,null,null,null,null,null,null,null,null,null,null,null,null,300,"Travis Kelce","KAN",33,"TE",17,17,2,5,0,1,4,2.5,0.3,1,null,301,"Breshad Perriman","TAM",29,"WR",11,3,19,9,0.47399999999999998,110,12.2,1,5,28,5.8,0.8,10,2]
[null,null,null,null,null,null,null,null,null,null,null,null,null,null,null,null,null,null,null,null,null,null,null,null,null,null,null,null,null,null,null,null,null,null,null,null,301,"Cole Kmet","CHI",23,"TE",17,17,2,9,0,1,8,4.5,0.5,1,null,302,"Craig Reynolds","DET",26,"RB",9,0,10,9,0.9,116,12.9,0,5,36,11.6,1,12.9,0]
[null,null,null,null,null,null,null,null,null,null,null,null,null,null,null,null,null,null,null,null,null,null,null,null,null,null,null,null,null,null,null,null,null,null,null,null,302,"Allen Lazard","GNB",27,"WR",15,15,2,0,0,0,1,0,0,0,null,303,"Brian Robinson Jr.","WAS",23,"RB",12,9,12,9,0.75,60,6.7,1,3,18,5,0.8,5,2]
[null,null,null,null,null,null,null,null,null,null,null,null,null,null,null,null,null,null,null,null,null,null,null,null,null,null,null,null,null,null,null,null,null,null,null,null,303,"Jakobi Meyers","NWE",26,"WR",14,13,2,-11,0,2,7,-5.5,-0.8,2,null,304,"Eric Tomlinson","DEN",30,"TE",17,12,13,9,0.69199999999999995,79,8.8000000000000007,2,5,18,6.1,0.5,4.5999999999999996,0]
[null,null,null,null,null,null,null,null,null,null,null,null,null,null,null,null,null,null,null,null,null,null,null,null,null,null,null,null,null,null,null,null,null,null,null,null,304,"Ty Montgomery","NWE",29,"WR",1,0,2,-2,0,0,0,-1,-2,0,null,305,"Kyren Williams","LAR",22,"RB",10,0,12,9,0.75,76,8.4,0,5,15,6.3,0.9,7.6,0]
[null,null,null,null,null,null,null,null,null,null,null,null,null,null,null,null,null,null,null,null,null,null,null,null,null,null,null,null,null,null,null,null,null,null,null,null,305,"C.J. Moore","DET",27,"S",11,0,2,55,0,2,42,27.5,5,1,null,306,"Reggie Gilliam","BUF",25,"FB",15,4,10,8,0.8,69,8.6,1,4,14,6.9,0.5,4.5999999999999996,0]
[null,null,null,null,null,null,null,null,null,null,null,null,null,null,null,null,null,null,null,null,null,null,null,null,null,null,null,null,null,null,null,null,null,null,null,null,306,"David Njoku","CLE",26,"TE",14,14,2,-8,0,0,-2,-4,-0.6,1,null,307,"Tom Kennedy","DET",26,"WR",7,1,15,8,0.53300000000000003,141,17.600000000000001,0,7,44,9.4,1.1000000000000001,20.100000000000001,0]
[null,null,null,null,null,null,null,null,null,null,null,null,null,null,null,null,null,null,null,null,null,null,null,null,null,null,null,null,null,null,null,null,null,null,null,null,307,"Breshad Perriman","TAM",29,"WR",11,3,2,-7,0,0,0,-3.5,-0.6,2,null,308,"Marlon Mack","2TM",26,null,8,0,10,8,0.8,99,12.4,1,2,66,9.9,1,12.4,0]
[null,null,null,null,null,null,null,null,null,null,null,null,null,null,null,null,null,null,null,null,null,null,null,null,null,null,null,null,null,null,null,null,null,null,null,null,308,"Nathan Peterman","CHI",28,"QB",3,1,2,7,0,0,6,3.5,2.2999999999999998,0,null,309,"Quintin Morris","BUF",23,"TE",14,1,11,8,0.72699999999999998,84,10.5,1,6,26,7.6,0.6,6,1]
[null,null,null,null,null,null,null,null,null,null,null,null,null,null,null,null,null,null,null,null,null,null,null,null,null,null,null,null,null,null,null,null,null,null,null,null,309,"Dante Pettis","CHI",27,"WR",17,7,2,37,0,2,29,18.5,2.2000000000000002,1,null,310,"Kyle Philips","TEN",23,"WR",4,0,13,8,0.61499999999999999,78,9.8000000000000007,0,3,21,6,2,19.5,2]
[null,null,null,null,null,null,null,null,null,null,null,null,null,null,null,null,null,null,null,null,null,null,null,null,null,null,null,null,null,null,null,null,null,null,null,null,310,"Wan'Dale Robinson","NYG",21,"WR",6,3,2,-1,0,0,4,-0.5,-0.2,0,null,311,"James Proche","BAL",26,"WR",15,0,17,8,0.47099999999999997,62,7.8,0,3,12,3.6,0.5,4.0999999999999996,0]
[null,null,null,null,null,null,null,null,null,null,null,null,null,null,null,null,null,null,null,null,null,null,null,null,null,null,null,null,null,null,null,null,null,null,null,null,311,"Amari Rodgers","2TM",23,null,16,1,2,7,0,0,4,3.5,0.4,6,null,312,"Jalen Reagor","MIN",23,"WR",17,0,13,8,0.61499999999999999,104,13,1,5,38,8,0.5,6.1,4]
[null,null,null,null,null,null,null,null,null,null,null,null,null,null,null,null,null,null,null,null,null,null,null,null,null,null,null,null,null,null,null,null,null,null,null,null,312,"Armani Rogers","WAS",25,"TE",11,3,2,26,0,1,24,13,2.4,0,null,313,"Giovanni Ricci","CAR",26,"TE",15,3,9,8,0.88900000000000001,100,12.5,0,3,32,11.1,0.5,6.7,0]
[null,null,null,null,null,null,null,null,null,null,null,null,null,null,null,null,null,null,null,null,null,null,null,null,null,null,null,null,null,null,null,null,null,null,null,null,313,"Trey Sermon","PHI",23,"RB",2,0,2,19,0,2,14,9.5,9.5,0,null,314,"Cam Sims","WAS",26,"WR",17,3,18,8,0.44400000000000001,89,11.1,0,5,21,4.9000000000000004,0.5,5.2,0]
[null,null,null,null,null,null,null,null,null,null,null,null,null,null,null,null,null,null,null,null,null,null,null,null,null,null,null,null,null,null,null,null,null,null,null,null,314,"Durham Smythe","MIA",27,"TE",16,15,2,1,1,1,1,0.5,0.1,0,null,315,"Jeff Smith","NYJ",25,"WR",11,0,11,8,0.72699999999999998,134,16.8,0,5,50,12.2,0.7,12.2,0]
[null,null,null,null,null,null,null,null,null,null,null,null,null,null,null,null,null,null,null,null,null,null,null,null,null,null,null,null,null,null,null,null,null,null,null,null,315,"Deven Thompkins","TAM",23,"WR",5,1,2,26,0,1,17,13,5.2,1,null,316,"Andre Baccellia","ARI",25,"WR",8,0,10,7,0.7,45,6.4,0,4,11,4.5,0.9,5.6,0]
[null,null,null,null,null,null,null,null,null,null,null,null,null,null,null,null,null,null,null,null,null,null,null,null,null,null,null,null,null,null,null,null,null,null,null,null,316,"Damien Williams","ATL",30,"RB",1,1,2,2,0,0,2,1,2,0,null,317,"J.K. Dobbins","BAL",24,"RB",8,8,8,7,0.875,42,6,1,3,20,5.3,0.9,5.3,0]
[null,null,null,null,null,null,null,null,null,null,null,null,null,null,null,null,null,null,null,null,null,null,null,null,null,null,null,null,null,null,null,null,null,null,null,null,317,"Olamide Zaccheaus","ATL",25,"WR",17,13,2,7,0,1,13,3.5,0.4,1,null,318,"D'Wayne Eskridge","SEA",25,"WR",10,0,13,7,0.53800000000000003,58,8.3000000000000007,0,4,16,4.5,0.7,5.8,0]
[null,null,null,null,null,null,null,null,null,null,null,null,null,null,null,null,null,null,null,null,null,null,null,null,null,null,null,null,null,null,null,null,null,null,null,null,318,"Keenan Allen","LAC",30,"WR",10,10,1,8,0,1,8,8,0.8,1,null,319,"KJ Hamler","DEN",23,"WR",7,0,14,7,0.5,165,23.6,0,3,55,11.8,1,23.6,0]
[null,null,null,null,null,null,null,null,null,null,null,null,null,null,null,null,null,null,null,null,null,null,null,null,null,null,null,null,null,null,null,null,null,null,null,null,319,"Marcus Allen","PIT",26,"LB",15,0,1,4,0,1,4,4,0.3,0,null,320,"N'Keal Harry","CHI",25,"WR",7,0,9,7,0.77800000000000002,116,16.600000000000001,1,4,49,12.9,1,16.600000000000001,0]
[null,null,null,null,null,null,null,null,null,null,null,null,null,null,null,null,null,null,null,null,null,null,null,null,null,null,null,null,null,null,null,null,null,null,null,null,320,"Bryan Anger","DAL",34,"P",17,0,1,0,0,0,-13,0,0,1,null,321,"T.Y. Hilton","DAL",33,"WR",3,0,10,7,0.7,121,17.3,0,5,52,12.1,2.2999999999999998,40.299999999999997,0]
[null,null,null,null,null,null,null,null,null,null,null,null,null,null,null,null,null,null,null,null,null,null,null,null,null,null,null,null,null,null,null,null,null,null,null,null,321,"Tyler Badie","DEN",22,"RB",1,0,1,0,0,0,0,0,0,0,null,322,"Brycen Hopkins","LAR",25,"TE",14,1,11,7,0.63600000000000001,109,15.6,0,5,22,9.9,0.5,7.8,0]
[null,null,null,null,null,null,null,null,null,null,null,null,null,null,null,null,null,null,null,null,null,null,null,null,null,null,null,null,null,null,null,null,null,null,null,null,322,"Daniel Bellinger","NYG",22,"TE",12,11,1,2,1,1,2,2,0.2,1,null,323,"Velus Jones Jr.","CHI",25,"WR",12,2,14,7,0.5,107,15.3,1,4,44,7.6,0.6,8.9,3]
[null,null,null,null,null,null,null,null,null,null,null,null,null,null,null,null,null,null,null,null,null,null,null,null,null,null,null,null,null,null,null,null,null,null,null,null,323,"Nick Bellore","SEA",33,"LB",16,0,1,3,0,0,3,3,0.2,0,null,324,"Ko Kieft","TAM",24,"TE",17,12,10,7,0.7,80,11.4,1,5,19,8,0.4,4.7,0]
[null,null,null,null,null,null,null,null,null,null,null,null,null,null,null,null,null,null,null,null,null,null,null,null,null,null,null,null,null,null,null,null,null,null,null,null,324,"Dyami Brown","WAS",23,"WR",15,0,1,15,0,1,15,15,1,0,null,325,"Chris Myarick","NYG",27,"FB",16,8,8,7,0.875,65,9.3000000000000007,1,5,23,8.1,0.4,4.0999999999999996,0]
[null,null,null,null,null,null,null,null,null,null,null,null,null,null,null,null,null,null,null,null,null,null,null,null,null,null,null,null,null,null,null,null,null,null,null,null,325,"Marquise Brown","ARI",25,"WR",12,10,1,1,0,0,1,1,0.1,1,null,326,"Teagan Quitoriano","HOU",22,"TE",9,6,14,7,0.5,113,16.100000000000001,2,5,52,8.1,0.8,12.6,0]
[null,null,null,null,null,null,null,null,null,null,null,null,null,null,null,null,null,null,null,null,null,null,null,null,null,null,null,null,null,null,null,null,null,null,null,null,326,"Harrison Bryant","CLE",24,"TE",17,9,1,8,0,1,8,8,0.5,0,null,327,"Pierre Strong","NWE",24,"RB",15,0,7,7,1,42,6,0,3,16,6,0.5,2.8,0]
[null,null,null,null,null,null,null,null,null,null,null,null,null,null,null,null,null,null,null,null,null,null,null,null,null,null,null,null,null,null,null,null,null,null,null,null,327,"Jason Cabinda","DET",26,"FB",8,2,1,4,0,1,4,4,0.5,0,null,328,"Jonathan Williams","WAS",28,"RB",13,2,10,7,0.7,40,5.7,0,2,21,4,0.5,3.1,0]
[null,null,null,null,null,null,null,null,null,null,null,null,null,null,null,null,null,null,null,null,null,null,null,null,null,null,null,null,null,null,null,null,null,null,null,null,328,"Sean Chandler","CAR",26,"S",17,0,1,2,0,1,2,2,0.1,0,null,329,"Cole Beasley","2TM",33,null,4,1,7,6,0.85699999999999998,35,5.8,0,1,9,5,1.5,8.8000000000000007,0]
[null,null,null,null,null,null,null,null,null,null,null,null,null,null,null,null,null,null,null,null,null,null,null,null,null,null,null,null,null,null,null,null,null,null,null,null,329,"Chase Daniel","LAC",36,"QB",4,0,1,4,0,0,4,4,1,0,null,"Rk","Player","Tm","Age","Pos","G","GS","Tgt","Rec","Ctch%","Yds","Y/R","TD","1D","Lng","Y/Tgt","R/G","Y/G","Fmb"]
[null,null,null,null,null,null,null,null,null,null,null,null,null,null,null,null,null,null,null,null,null,null,null,null,null,null,null,null,null,null,null,null,null,null,null,null,"Rk","Player","Tm","Age","Pos","G","GS","Att","Yds","TD","1D","Lng","Y/A","Y/G","Fmb",null,330,"Jamison Crowder","BUF",29,"WR",4,0,13,6,0.46200000000000002,60,10,0,4,16,4.5999999999999996,1.5,15,1]
[null,null,null,null,null,null,null,null,null,null,null,null,null,null,null,null,null,null,null,null,null,null,null,null,null,null,null,null,null,null,null,null,null,null,null,null,330,"Jaelon Darden","2TM",23,null,14,0,1,2,0,0,2,2,0.1,0,null,331,"Malik Davis","DAL",24,"RB",12,0,7,6,0.85699999999999998,63,10.5,0,5,18,9,0.5,5.3,0]
[null,null,null,null,null,null,null,null,null,null,null,null,null,null,null,null,null,null,null,null,null,null,null,null,null,null,null,null,null,null,null,null,null,null,null,null,331,"Ashtyn Davis","NYJ",26,"S",14,0,1,2,0,1,2,2,0.1,0,null,332,"Royce Freeman","HOU",26,"RB",4,1,8,6,0.75,33,5.5,0,0,9,4.0999999999999996,1.5,8.3000000000000007,1]
[null,null,null,null,null,null,null,null,null,null,null,null,null,null,null,null,null,null,null,null,null,null,null,null,null,null,null,null,null,null,null,null,null,null,null,null,332,"Stefon Diggs","BUF",29,"WR",16,16,1,-3,0,0,-3,-3,-0.2,1,null,333,"Kenny Golladay","NYG",29,"WR",12,4,17,6,0.35299999999999998,81,13.5,1,4,25,4.8,0.5,6.8,0]
[null,null,null,null,null,null,null,null,null,null,null,null,null,null,null,null,null,null,null,null,null,null,null,null,null,null,null,null,null,null,null,null,null,null,null,null,333,"Romeo Doubs","GNB",22,"WR",13,7,1,11,0,1,11,11,0.8,2,null,334,"Brandon Johnson","DEN",24,"WR",7,1,14,6,0.42899999999999999,42,7,1,2,12,3,0.9,6,1]
[null,null,null,null,null,null,null,null,null,null,null,null,null,null,null,null,null,null,null,null,null,null,null,null,null,null,null,null,null,null,null,null,null,null,null,null,334,"Gerald Everett","LAC",28,"TE",16,11,1,0,0,0,0,0,0,0,null,335,"Marcedes Lewis","GNB",38,"TE",17,17,7,6,0.85699999999999998,66,11,2,5,31,9.4,0.4,3.9,0]
[null,null,null,null,null,null,null,null,null,null,null,null,null,null,null,null,null,null,null,null,null,null,null,null,null,null,null,null,null,null,null,null,null,null,null,null,335,"Matthias Farley","LVR",30,"S",17,0,1,-3,0,0,-3,-3,-0.2,0,null,336,"Phillip Lindsay","IND",28,"RB",3,0,8,6,0.75,19,3.2,0,0,7,2.4,2,6.3,0]
[null,null,null,null,null,null,null,null,null,null,null,null,null,null,null,null,null,null,null,null,null,null,null,null,null,null,null,null,null,null,null,null,null,null,null,null,336,"Clayton Fejedelem","MIA",29,"S",13,0,1,0,0,0,0,0,0,0,null,337,"Chris Manhertz","JAX",30,"TE",17,11,8,6,0.75,42,7,0,2,21,5.3,0.4,2.5,0]
[null,null,null,null,null,null,null,null,null,null,null,null,null,null,null,null,null,null,null,null,null,null,null,null,null,null,null,null,null,null,null,null,null,null,null,null,337,"Demetric Felton","CLE",24,"RB",8,2,1,-4,0,0,-4,-4,-0.5,1,null,338,"Dax Milne","WAS",23,"WR",15,1,7,6,0.85699999999999998,37,6.2,1,2,12,5.3,0.4,2.5,1]
[null,null,null,null,null,null,null,null,null,null,null,null,null,null,null,null,null,null,null,null,null,null,null,null,null,null,null,null,null,null,null,null,null,null,null,null,338,"Feleipe Franks","ATL",25,"TE",11,1,1,0,0,0,0,0,0,0,null,339,"Trent Taylor","CIN",28,"WR",16,1,10,6,0.6,62,10.3,0,1,34,6.2,0.4,3.9,2]
[null,null,null,null,null,null,null,null,null,null,null,null,null,null,null,null,null,null,null,null,null,null,null,null,null,null,null,null,null,null,null,null,null,null,null,null,339,"Kylen Granson","IND",24,"TE",13,4,1,0,0,0,0,0,0,1,null,340,"Laquon Treadwell","SEA",27,"WR",6,0,10,6,0.6,42,7,0,3,17,4.2,1,7,0]
[null,null,null,null,null,null,null,null,null,null,null,null,null,null,null,null,null,null,null,null,null,null,null,null,null,null,null,null,null,null,null,null,null,null,null,null,340,"Danny Gray","SFO",23,"WR",13,0,1,9,0,0,9,9,0.7,0,null,341,"Nick Vannett","2TM",29,null,9,3,9,6,0.66700000000000004,55,9.1999999999999993,0,1,15,6.1,0.7,6.1,0]
[null,null,null,null,null,null,null,null,null,null,null,null,null,null,null,null,null,null,null,null,null,null,null,null,null,null,null,null,null,null,null,null,null,null,null,null,341,"Noah Gray","KAN",23,"TE",17,8,1,1,1,1,1,1,0.1,0,null,342,"Jordan Wilkins","IND",28,"RB",4,0,8,6,0.75,29,4.8,0,1,10,3.6,1.5,7.3,0]
[null,null,null,null,null,null,null,null,null,null,null,null,null,null,null,null,null,null,null,null,null,null,null,null,null,null,null,null,null,null,null,null,null,null,null,null,342,"Peyton Hendershot","DAL",23,"TE",17,2,1,2,1,1,2,2,0.1,1,null,343,"Andrew Beck","DEN",26,"FB",13,4,11,5,0.45500000000000002,69,13.8,0,2,27,6.3,0.4,5.3,0]
[null,null,null,null,null,null,null,null,null,null,null,null,null,null,null,null,null,null,null,null,null,null,null,null,null,null,null,null,null,null,null,null,null,null,null,null,343,"Kylin Hill","GNB",24,"RB",2,0,1,7,0,1,7,7,3.5,0,null,344,"Gary Brightwell","NYG",23,"RB",17,0,8,5,0.625,39,7.8,0,4,12,4.9000000000000004,0.3,2.2999999999999998,0]
[null,null,null,null,null,null,null,null,null,null,null,null,null,null,null,null,null,null,null,null,null,null,null,null,null,null,null,null,null,null,null,null,null,null,null,null,344,"Jordan Howard","NOR",28,"RB",2,0,1,1,0,0,1,1,0.5,0,null,345,"Dyami Brown","WAS",23,"WR",15,0,14,5,0.35699999999999998,143,28.6,2,5,75,10.199999999999999,0.3,9.5,0]
[null,null,null,null,null,null,null,null,null,null,null,null,null,null,null,null,null,null,null,null,null,null,null,null,null,null,null,null,null,null,null,null,null,null,null,null,345,"Robert Hunt","MIA",26,"OL",17,17,1,0,0,0,0,0,0,1,null,346,"Malcolm Brown","LAR",29,"RB",11,0,6,5,0.83299999999999996,37,7.4,0,2,13,6.2,0.5,3.4,0]
[null,null,null,null,null,null,null,null,null,null,null,null,null,null,null,null,null,null,null,null,null,null,null,null,null,null,null,null,null,null,null,null,null,null,null,null,346,"Trenton Irwin","CIN",27,"WR",9,2,1,11,0,1,11,11,1.2,0,null,347,"Grant Calcaterra","PHI",24,"TE",15,2,9,5,0.55600000000000005,81,16.2,0,3,40,9,0.3,5.4,0]
[null,null,null,null,null,null,null,null,null,null,null,null,null,null,null,null,null,null,null,null,null,null,null,null,null,null,null,null,null,null,null,null,null,null,null,null,347,"Andy Isabella","2TM",26,null,5,0,1,1,0,0,1,1,0.2,0,null,348,"Corey Clement","ARI",28,"RB",9,1,7,5,0.71399999999999997,54,10.8,0,3,21,7.7,0.6,6,0]
[null,null,null,null,null,null,null,null,null,null,null,null,null,null,null,null,null,null,null,null,null,null,null,null,null,null,null,null,null,null,null,null,null,null,null,null,348,"Dallin Leavitt","GNB",28,"S",17,0,1,0,0,0,0,0,0,0,null,349,"D'Onta Foreman","CAR",26,"RB",17,9,9,5,0.55600000000000005,26,5.2,0,1,23,2.9,0.3,1.5,1]
[null,null,null,null,null,null,null,null,null,null,null,null,null,null,null,null,null,null,null,null,null,null,null,null,null,null,null,null,null,null,null,null,null,null,null,null,349,"Jordan Love","GNB",24,"QB",4,0,1,-1,0,0,-1,-1,-0.3,0,null,350,"Troy Hairston","HOU",24,"FB",16,5,8,5,0.625,19,3.8,0,0,7,2.4,0.3,1.2,0]
[null,null,null,null,null,null,null,null,null,null,null,null,null,null,null,null,null,null,null,null,null,null,null,null,null,null,null,null,null,null,null,null,null,null,null,null,350,"Racey McMath","TEN",23,"WR",5,0,1,4,0,0,4,4,0.8,0,null,351,"Zander Horvath","LAC",24,"FB",15,2,8,5,0.625,8,1.6,2,2,5,1,0.3,0.5,0]
[null,null,null,null,null,null,null,null,null,null,null,null,null,null,null,null,null,null,null,null,null,null,null,null,null,null,null,null,null,null,null,null,null,null,null,null,351,"Scott Miller","TAM",25,"WR",15,1,1,8,0,0,8,8,0.5,0,null,352,"Jakob Johnson","LVR",28,"FB",17,9,6,5,0.83299999999999996,10,2,0,0,5,1.7,0.3,0.6,0]
[null,null,null,null,null,null,null,null,null,null,null,null,null,null,null,null,null,null,null,null,null,null,null,null,null,null,null,null,null,null,null,null,null,null,null,null,352,"Darnell Mooney","CHI",25,"WR",12,12,1,2,0,0,2,2,0.2,0,null,353,"Tony Jones","2TM",25,"RB",6,0,8,5,0.625,30,6,0,0,9,3.8,0.8,5,0]
[null,null,null,null,null,null,null,null,null,null,null,null,null,null,null,null,null,null,null,null,null,null,null,null,null,null,null,null,null,null,null,null,null,null,null,null,353,"Josh Palmer","LAC",24,"WR",16,11,1,4,0,1,4,4,0.3,1,null,354,"Gunner Olszewski","PIT",26,"WR",16,2,7,5,0.71399999999999997,53,10.6,0,1,31,7.6,0.3,3.3,2]
[null,null,null,null,null,null,null,null,null,null,null,null,null,null,null,null,null,null,null,null,null,null,null,null,null,null,null,null,null,null,null,null,null,null,null,null,354,"Zach Pascal","PHI",28,"WR",17,2,1,0,0,0,0,0,0,0,null,355,"Ronnie Rivers","LAR",23,"RB",8,1,5,5,1,29,5.8,0,1,14,5.8,0.6,3.6,0]
[null,null,null,null,null,null,null,null,null,null,null,null,null,null,null,null,null,null,null,null,null,null,null,null,null,null,null,null,null,null,null,null,null,null,null,null,355,"Donovan Peoples-Jones","CLE",23,"WR",17,14,1,2,0,0,2,2,0.1,1,null,356,"Armani Rogers","WAS",25,"TE",11,3,6,5,0.83299999999999996,64,12.8,0,4,23,10.7,0.5,5.8,0]
[null,null,null,null,null,null,null,null,null,null,null,null,null,null,null,null,null,null,null,null,null,null,null,null,null,null,null,null,null,null,null,null,null,null,null,null,356,"Ben Skowronek","LAR",25,"WR",14,11,1,17,1,1,17,17,1.2,0,null,357,"Boston Scott","PHI",27,"RB",15,2,6,5,0.83299999999999996,15,3,0,0,5,2.5,0.3,1,0]
[null,null,null,null,null,null,null,null,null,null,null,null,null,null,null,null,null,null,null,null,null,null,null,null,null,null,null,null,null,null,null,null,null,null,null,null,357,"Jonnu Smith","NWE",27,"TE",14,8,1,5,0,1,5,5,0.4,1,null,358,"Deven Thompkins","TAM",23,"WR",5,1,10,5,0.5,32,6.4,0,1,13,3.2,1,6.4,1]
[null,null,null,null,null,null,null,null,null,null,null,null,null,null,null,null,null,null,null,null,null,null,null,null,null,null,null,null,null,null,null,null,null,null,null,null,358,"Keith Smith","ATL",30,"FB",17,6,1,2,0,1,2,2,0.1,0,null,359,"Samori Toure","GNB",24,"WR",11,2,10,5,0.5,82,16.399999999999999,1,2,37,8.1999999999999993,0.5,7.5,1]
[null,null,null,null,null,null,null,null,null,null,null,null,null,null,null,null,null,null,null,null,null,null,null,null,null,null,null,null,null,null,null,null,null,null,null,null,359,"Ihmir Smith-Marsette","2TM",23,null,8,0,1,-1,0,0,0,-1,-0.1,1,null,"Rk","Player","Tm","Age","Pos","G","GS","Tgt","Rec","Ctch%","Yds","Y/R","TD","1D","Lng","Y/Tgt","R/G","Y/G","Fmb"]
[null,null,null,null,null,null,null,null,null,null,null,null,null,null,null,null,null,null,null,null,null,null,null,null,null,null,null,null,null,null,null,null,null,null,null,null,"Rk","Player","Tm","Age","Pos","G","GS","Att","Yds","TD","1D","Lng","Y/A","Y/G","Fmb",null,360,"Derek Watt","PIT",30,"FB",17,3,5,5,1,11,2.2000000000000002,1,1,5,2.2000000000000002,0.3,0.6,0]
[null,null,null,null,null,null,null,null,null,null,null,null,null,null,null,null,null,null,null,null,null,null,null,null,null,null,null,null,null,null,null,null,null,null,null,null,360,"M.J. Stewart","HOU",27,"DB",17,0,1,3,0,1,3,3,0.2,0,null,361,"Michael Woods II","CLE",22,"WR",10,0,10,5,0.5,45,9,0,3,15,4.5,0.5,4.5,0]
[null,null,null,null,null,null,null,null,null,null,null,null,null,null,null,null,null,null,null,null,null,null,null,null,null,null,null,null,null,null,null,null,null,null,null,null,361,"Courtland Sutton","DEN",27,"WR",15,15,1,5,0,0,5,5,0.3,0,null,362,"Chris Conley","2TM",30,"WR",9,1,7,4,0.57099999999999995,46,11.5,0,2,27,6.6,0.4,5.0999999999999996,0]
[null,null,null,null,null,null,null,null,null,null,null,null,null,null,null,null,null,null,null,null,null,null,null,null,null,null,null,null,null,null,null,null,null,null,null,null,362,"Adam Thielen","MIN",32,"WR",17,17,1,4,0,0,4,4,0.2,0,null,363,"Tyler Davis","GNB",25,"TE",17,1,7,4,0.57099999999999995,26,6.5,0,1,23,3.7,0.2,1.5,0]
[null,null,null,null,null,null,null,null,null,null,null,null,null,null,null,null,null,null,null,null,null,null,null,null,null,null,null,null,null,null,null,null,null,null,null,null,363,"Marquez Valdes-Scantling","KAN",28,"WR",17,11,1,-3,0,0,-3,-3,-0.2,0,null,364,"Luke Farrell","JAX",25,"TE",17,0,4,4,1,40,10,0,3,15,10,0.2,2.4,0]
[null,null,null,null,null,null,null,null,null,null,null,null,null,null,null,null,null,null,null,null,null,null,null,null,null,null,null,null,null,null,null,null,null,null,null,null,364,"Jameson Williams","DET",21,"WR",6,0,1,40,0,1,40,40,6.7,0,null,365,"Myles Gaskin","MIA",25,"RB",4,0,6,4,0.66700000000000004,28,7,0,0,16,4.7,1,7,0]
[null,null,null,null,null,null,null,null,null,null,null,null,null,null,null,null,null,null,null,null,null,null,null,null,null,null,null,null,null,null,null,null,null,null,null,null,365,"Cedrick Wilson Jr.","MIA",27,"WR",15,0,1,8,0,0,8,8,0.5,0,null,366,"Ryan Griffin","CHI",32,"TE",15,0,8,4,0.5,26,6.5,0,1,18,3.3,0.3,1.7,0]
[null,null,null,null,null,null,null,null,null,null,null,null,null,null,null,null,null,null,null,null,null,null,null,null,null,null,null,null,null,null,null,null,null,null,null,null,366,"Michael Woods II","CLE",22,"WR",10,0,1,-5,0,0,-5,-5,-0.5,0,null,367,"Keaontay Ingram","ARI",23,"RB",12,0,5,4,0.8,21,5.3,0,1,24,4.2,0.3,1.8,0]
[null,null,null,null,null,null,null,null,null,null,null,null,null,null,null,null,null,null,null,null,null,null,null,null,null,null,null,null,null,null,null,null,null,null,null,null,null,null,null,null,null,null,null,null,null,null,null,null,null,null,null,null,368,"David Johnson","NOR",31,"RB",5,0,4,4,1,47,11.8,0,3,21,11.8,0.8,9.4,1]
[null,null,null,null,null,null,null,null,null,null,null,null,null,null,null,null,null,null,null,null,null,null,null,null,null,null,null,null,null,null,null,null,null,null,null,null,null,null,null,null,null,null,null,null,null,null,null,null,null,null,null,null,369,"Marcus Jones","NWE",24,"DB",15,4,4,4,1,78,19.5,1,3,48,19.5,0.3,5.2,1]
[null,null,null,null,null,null,null,null,null,null,null,null,null,null,null,null,null,null,null,null,null,null,null,null,null,null,null,null,null,null,null,null,null,null,null,null,null,null,null,null,null,null,null,null,null,null,null,null,null,null,null,null,370,"Charlie Kolar","BAL",23,"TE",2,0,6,4,0.66700000000000004,49,12.3,0,3,15,8.1999999999999993,2,24.5,0]
[null,null,null,null,null,null,null,null,null,null,null,null,null,null,null,null,null,null,null,null,null,null,null,null,null,null,null,null,null,null,null,null,null,null,null,null,null,null,null,null,null,null,null,null,null,null,null,null,null,null,null,null,371,"Tyler Kroft","SFO",30,"TE",11,4,5,4,0.8,57,14.3,0,2,28,11.4,0.4,5.2,0]
[null,null,null,null,null,null,null,null,null,null,null,null,null,null,null,null,null,null,null,null,null,null,null,null,null,null,null,null,null,null,null,null,null,null,null,null,null,null,null,null,null,null,null,null,null,null,null,null,null,null,null,null,372,"Jake Kumerow","BUF",30,"WR",6,1,7,4,0.57099999999999995,64,16,0,4,39,9.1,0.7,10.7,0]
[null,null,null,null,null,null,null,null,null,null,null,null,null,null,null,null,null,null,null,null,null,null,null,null,null,null,null,null,null,null,null,null,null,null,null,null,null,null,null,null,null,null,null,null,null,null,null,null,null,null,null,null,373,"Rashaad Penny","SEA",26,"RB",5,5,5,4,0.8,16,4,0,2,6,3.2,0.8,3.2,1]
[null,null,null,null,null,null,null,null,null,null,null,null,null,null,null,null,null,null,null,null,null,null,null,null,null,null,null,null,null,null,null,null,null,null,null,null,null,null,null,null,null,null,null,null,null,null,null,null,null,null,null,null,374,"Anthony Schwartz","CLE",22,"WR",11,1,10,4,0.4,51,12.8,0,2,19,5.0999999999999996,0.4,4.5999999999999996,1]
[null,null,null,null,null,null,null,null,null,null,null,null,null,null,null,null,null,null,null,null,null,null,null,null,null,null,null,null,null,null,null,null,null,null,null,null,null,null,null,null,null,null,null,null,null,null,null,null,null,null,null,null,375,"Stone Smartt","LAC",24,"TE",7,1,5,4,0.8,17,4.3,0,1,8,3.4,0.6,2.4,0]
[null,null,null,null,null,null,null,null,null,null,null,null,null,null,null,null,null,null,null,null,null,null,null,null,null,null,null,null,null,null,null,null,null,null,null,null,null,null,null,null,null,null,null,null,null,null,null,null,null,null,null,null,376,"Freddie Swain","2TM",24,null,4,1,6,4,0.66700000000000004,74,18.5,0,3,52,12.3,1,18.5,1]
[null,null,null,null,null,null,null,null,null,null,null,null,null,null,null,null,null,null,null,null,null,null,null,null,null,null,null,null,null,null,null,null,null,null,null,null,null,null,null,null,null,null,null,null,null,null,null,null,null,null,null,null,377,"Tylan Wallace","BAL",23,"WR",9,0,7,4,0.57099999999999995,33,8.3000000000000007,0,1,12,4.7,0.4,3.7,0]
[null,null,null,null,null,null,null,null,null,null,null,null,null,null,null,null,null,null,null,null,null,null,null,null,null,null,null,null,null,null,null,null,null,null,null,null,null,null,null,null,null,null,null,null,null,null,null,null,null,null,null,null,378,"Montrell Washington","DEN",23,"WR",15,1,9,4,0.44400000000000001,2,0.5,0,0,4,0.2,0.3,0.1,5]
[null,null,null,null,null,null,null,null,null,null,null,null,null,null,null,null,null,null,null,null,null,null,null,null,null,null,null,null,null,null,null,null,null,null,null,null,null,null,null,null,null,null,null,null,null,null,null,null,null,null,null,null,379,"Darrel Williams","ARI",27,"RB",6,0,8,4,0.5,9,2.2999999999999998,0,0,6,1.1000000000000001,0.7,1.5,0]
[null,null,null,null,null,null,null,null,null,null,null,null,null,null,null,null,null,null,null,null,null,null,null,null,null,null,null,null,null,null,null,null,null,null,null,null,null,null,null,null,null,null,null,null,null,null,null,null,null,null,null,null,380,"Stephen Anderson","ARI",29,"TE",16,0,7,3,0.42899999999999999,9,3,0,0,6,1.3,0.2,0.6,0]
[null,null,null,null,null,null,null,null,null,null,null,null,null,null,null,null,null,null,null,null,null,null,null,null,null,null,null,null,null,null,null,null,null,null,null,null,null,null,null,null,null,null,null,null,null,null,null,null,null,null,null,null,381,"Julius Chestnut","TEN",22,"RB",6,0,3,3,1,41,13.7,0,1,33,13.7,0.5,6.8,0]
[null,null,null,null,null,null,null,null,null,null,null,null,null,null,null,null,null,null,null,null,null,null,null,null,null,null,null,null,null,null,null,null,null,null,null,null,null,null,null,null,null,null,null,null,null,null,null,null,null,null,null,null,382,"Tevin Coleman","SFO",29,"RB",5,0,3,3,1,44,14.7,1,2,30,14.7,0.6,8.8000000000000007,0]
[null,null,null,null,null,null,null,null,null,null,null,null,null,null,null,null,null,null,null,null,null,null,null,null,null,null,null,null,null,null,null,null,null,null,null,null,null,null,null,null,null,null,null,null,null,null,null,null,null,null,null,null,383,"Ross Dwelley","SFO",27,"TE",12,0,5,3,0.6,105,35,1,3,56,21,0.3,8.8000000000000007,0]
[null,null,null,null,null,null,null,null,null,null,null,null,null,null,null,null,null,null,null,null,null,null,null,null,null,null,null,null,null,null,null,null,null,null,null,null,null,null,null,null,null,null,null,null,null,null,null,null,null,null,null,null,384,"Bryan Edwards","ATL",24,"WR",7,1,5,3,0.6,15,5,0,0,10,3,0.4,2.1,0]
[null,null,null,null,null,null,null,null,null,null,null,null,null,null,null,null,null,null,null,null,null,null,null,null,null,null,null,null,null,null,null,null,null,null,null,null,null,null,null,null,null,null,null,null,null,null,null,null,null,null,null,null,385,"Ben Ellefson","MIN",26,"TE",4,1,3,3,1,26,8.6999999999999993,0,2,12,8.6999999999999993,0.8,6.5,0]
[null,null,null,null,null,null,null,null,null,null,null,null,null,null,null,null,null,null,null,null,null,null,null,null,null,null,null,null,null,null,null,null,null,null,null,null,null,null,null,null,null,null,null,null,null,null,null,null,null,null,null,null,386,"Chris Evans","CIN",25,"RB",12,0,4,3,0.75,38,12.7,1,2,26,9.5,0.3,3.2,0]
[null,null,null,null,null,null,null,null,null,null,null,null,null,null,null,null,null,null,null,null,null,null,null,null,null,null,null,null,null,null,null,null,null,null,null,null,null,null,null,null,null,null,null,null,null,null,null,null,null,null,null,null,387,"Simi Fehoko","DAL",25,"WR",5,0,4,3,0.75,24,8,0,1,12,6,0.6,4.8,0]
[null,null,null,null,null,null,null,null,null,null,null,null,null,null,null,null,null,null,null,null,null,null,null,null,null,null,null,null,null,null,null,null,null,null,null,null,null,null,null,null,null,null,null,null,null,null,null,null,null,null,null,null,388,"Penny Hart","SEA",26,"WR",9,0,4,3,0.75,20,6.7,0,1,15,5,0.3,2.2000000000000002,0]
[null,null,null,null,null,null,null,null,null,null,null,null,null,null,null,null,null,null,null,null,null,null,null,null,null,null,null,null,null,null,null,null,null,null,null,null,null,null,null,null,null,null,null,null,null,null,null,null,null,null,null,null,389,"Cody Hollister","TEN",29,"WR",11,3,5,3,0.6,54,18,0,2,27,10.8,0.3,4.9000000000000004,0]
[null,null,null,null,null,null,null,null,null,null,null,null,null,null,null,null,null,null,null,null,null,null,null,null,null,null,null,null,null,null,null,null,null,null,null,null,null,null,null,null,null,null,null,null,null,null,null,null,null,null,null,null,"Rk","Player","Tm","Age","Pos","G","GS","Tgt","Rec","Ctch%","Yds","Y/R","TD","1D","Lng","Y/Tgt","R/G","Y/G","Fmb"]
[null,null,null,null,null,null,null,null,null,null,null,null,null,null,null,null,null,null,null,null,null,null,null,null,null,null,null,null,null,null,null,null,null,null,null,null,null,null,null,null,null,null,null,null,null,null,null,null,null,null,null,null,390,"Jesper Horsted","LVR",25,"TE",15,0,4,3,0.75,19,6.3,0,0,9,4.8,0.2,1.3,0]
[null,null,null,null,null,null,null,null,null,null,null,null,null,null,null,null,null,null,null,null,null,null,null,null,null,null,null,null,null,null,null,null,null,null,null,null,null,null,null,null,null,null,null,null,null,null,null,null,null,null,null,null,391,"D'Ernest Johnson","CLE",26,"RB",15,0,3,3,1,7,2.2999999999999998,0,0,7,2.2999999999999998,0.2,0.5,0]
[null,null,null,null,null,null,null,null,null,null,null,null,null,null,null,null,null,null,null,null,null,null,null,null,null,null,null,null,null,null,null,null,null,null,null,null,null,null,null,null,null,null,null,null,null,null,null,null,null,null,null,null,392,"Tim Jones","JAX",24,"WR",17,1,4,3,0.75,30,10,0,1,20,7.5,0.2,1.8,0]
[null,null,null,null,null,null,null,null,null,null,null,null,null,null,null,null,null,null,null,null,null,null,null,null,null,null,null,null,null,null,null,null,null,null,null,null,null,null,null,null,null,null,null,null,null,null,null,null,null,null,null,null,393,"Elijah Mitchell","SFO",24,"RB",5,1,4,3,0.75,7,2.2999999999999998,0,0,5,1.8,0.6,1.4,0]
[null,null,null,null,null,null,null,null,null,null,null,null,null,null,null,null,null,null,null,null,null,null,null,null,null,null,null,null,null,null,null,null,null,null,null,null,null,null,null,null,null,null,null,null,null,null,null,null,null,null,null,null,394,"Ty Montgomery","NWE",29,"WR",1,0,4,3,0.75,15,5,1,1,7,3.8,3,15,0]
[null,null,null,null,null,null,null,null,null,null,null,null,null,null,null,null,null,null,null,null,null,null,null,null,null,null,null,null,null,null,null,null,null,null,null,null,null,null,null,null,null,null,null,null,null,null,null,null,null,null,null,null,395,"Adam Prentice","NOR",25,"FB",11,2,3,3,1,9,3,0,1,4,3,0.3,0.8,1]
[null,null,null,null,null,null,null,null,null,null,null,null,null,null,null,null,null,null,null,null,null,null,null,null,null,null,null,null,null,null,null,null,null,null,null,null,null,null,null,null,null,null,null,null,null,null,null,null,null,null,null,null,396,"Kyle Rudolph","TAM",33,"TE",9,0,5,3,0.6,28,9.3000000000000007,1,2,12,5.6,0.3,3.1,0]
[null,null,null,null,null,null,null,null,null,null,null,null,null,null,null,null,null,null,null,null,null,null,null,null,null,null,null,null,null,null,null,null,null,null,null,null,null,null,null,null,null,null,null,null,null,null,null,null,null,null,null,null,397,"Isaiah Spiller","LAC",21,"RB",6,0,3,3,1,13,4.3,0,0,8,4.3,0.5,2.2000000000000002,0]
[null,null,null,null,null,null,null,null,null,null,null,null,null,null,null,null,null,null,null,null,null,null,null,null,null,null,null,null,null,null,null,null,null,null,null,null,null,null,null,null,null,null,null,null,null,null,null,null,null,null,null,null,398,"Mike Strachan","IND",25,"WR",13,0,9,3,0.33300000000000002,59,19.7,0,3,23,6.6,0.2,4.5,0]
[null,null,null,null,null,null,null,null,null,null,null,null,null,null,null,null,null,null,null,null,null,null,null,null,null,null,null,null,null,null,null,null,null,null,null,null,null,null,null,null,null,null,null,null,null,null,null,null,null,null,null,null,399,"Ke'Shawn Vaughn","TAM",25,"RB",15,0,4,3,0.75,19,6.3,0,1,11,4.8,0.2,1.3,0]
[null,null,null,null,null,null,null,null,null,null,null,null,null,null,null,null,null,null,null,null,null,null,null,null,null,null,null,null,null,null,null,null,null,null,null,null,null,null,null,null,null,null,null,null,null,null,null,null,null,null,null,null,400,"Maxx Williams","ARI",28,"TE",11,1,3,3,1,18,6,0,0,7,6,0.3,1.6,0]
[null,null,null,null,null,null,null,null,null,null,null,null,null,null,null,null,null,null,null,null,null,null,null,null,null,null,null,null,null,null,null,null,null,null,null,null,null,null,null,null,null,null,null,null,null,null,null,null,null,null,null,null,401,"Devin Asiasi","CIN",25,"TE",12,0,4,2,0.5,5,2.5,0,0,6,1.3,0.2,0.4,0]
[null,null,null,null,null,null,null,null,null,null,null,null,null,null,null,null,null,null,null,null,null,null,null,null,null,null,null,null,null,null,null,null,null,null,null,null,null,null,null,null,null,null,null,null,null,null,null,null,null,null,null,null,402,"Daylen Baldwin","CLE",23,"WR",1,0,2,2,1,25,12.5,0,2,15,12.5,2,25,0]
[null,null,null,null,null,null,null,null,null,null,null,null,null,null,null,null,null,null,null,null,null,null,null,null,null,null,null,null,null,null,null,null,null,null,null,null,null,null,null,null,null,null,null,null,null,null,null,null,null,null,null,null,403,"Blake Bell","KAN",31,"TE",3,1,2,2,1,20,10,1,1,17,10,0.7,6.7,0]
[null,null,null,null,null,null,null,null,null,null,null,null,null,null,null,null,null,null,null,null,null,null,null,null,null,null,null,null,null,null,null,null,null,null,null,null,null,null,null,null,null,null,null,null,null,null,null,null,null,null,null,null,404,"Giovani Bernard","TAM",31,"RB",8,0,2,2,1,-1,-0.5,0,0,6,-0.5,0.3,-0.1,1]
[null,null,null,null,null,null,null,null,null,null,null,null,null,null,null,null,null,null,null,null,null,null,null,null,null,null,null,null,null,null,null,null,null,null,null,null,null,null,null,null,null,null,null,null,null,null,null,null,null,null,null,null,405,"Kendall Blanton","LAR",27,"TE",4,0,2,2,1,35,17.5,0,1,28,17.5,0.5,8.8000000000000007,0]
[null,null,null,null,null,null,null,null,null,null,null,null,null,null,null,null,null,null,null,null,null,null,null,null,null,null,null,null,null,null,null,null,null,null,null,null,null,null,null,null,null,null,null,null,null,null,null,null,null,null,null,null,406,"Miles Boykin","PIT",26,"WR",16,1,3,2,0.66700000000000004,11,5.5,0,1,11,3.7,0.1,0.7,0]
[null,null,null,null,null,null,null,null,null,null,null,null,null,null,null,null,null,null,null,null,null,null,null,null,null,null,null,null,null,null,null,null,null,null,null,null,null,null,null,null,null,null,null,null,null,null,null,null,null,null,null,null,407,"Spencer Brown","CAR",24,"RB",2,0,4,2,0.5,10,5,0,0,9,2.5,1,5,0]
[null,null,null,null,null,null,null,null,null,null,null,null,null,null,null,null,null,null,null,null,null,null,null,null,null,null,null,null,null,null,null,null,null,null,null,null,null,null,null,null,null,null,null,null,null,null,null,null,null,null,null,null,408,"Michael Burton","KAN",30,"FB",17,0,3,2,0.66700000000000004,11,5.5,0,0,9,3.7,0.1,0.6,0]
[null,null,null,null,null,null,null,null,null,null,null,null,null,null,null,null,null,null,null,null,null,null,null,null,null,null,null,null,null,null,null,null,null,null,null,null,null,null,null,null,null,null,null,null,null,null,null,null,null,null,null,null,409,"Quintez Cephus","DET",24,"WR",4,1,3,2,0.66700000000000004,15,7.5,0,1,9,5,0.5,3.8,0]
[null,null,null,null,null,null,null,null,null,null,null,null,null,null,null,null,null,null,null,null,null,null,null,null,null,null,null,null,null,null,null,null,null,null,null,null,null,null,null,null,null,null,null,null,null,null,null,null,null,null,null,null,410,"Tyrie Cleveland","DEN",25,"WR",6,0,7,2,0.28599999999999998,28,14,0,1,16,4,0.3,4.7,0]
[null,null,null,null,null,null,null,null,null,null,null,null,null,null,null,null,null,null,null,null,null,null,null,null,null,null,null,null,null,null,null,null,null,null,null,null,null,null,null,null,null,null,null,null,null,null,null,null,null,null,null,null,411,"Pharoh Cooper","ARI",27,"WR",5,1,2,2,1,6,3,0,0,3,3,0.4,1.2,0]
[null,null,null,null,null,null,null,null,null,null,null,null,null,null,null,null,null,null,null,null,null,null,null,null,null,null,null,null,null,null,null,null,null,null,null,null,null,null,null,null,null,null,null,null,null,null,null,null,null,null,null,null,412,"Jaelon Darden","2TM",23,null,14,0,2,2,1,26,13,0,1,25,13,0.1,1.9,0]
[null,null,null,null,null,null,null,null,null,null,null,null,null,null,null,null,null,null,null,null,null,null,null,null,null,null,null,null,null,null,null,null,null,null,null,null,null,null,null,null,null,null,null,null,null,null,null,null,null,null,null,null,413,"Mike Davis","BAL",29,"RB",8,0,2,2,1,4,2,0,0,7,2,0.3,0.5,1]
[null,null,null,null,null,null,null,null,null,null,null,null,null,null,null,null,null,null,null,null,null,null,null,null,null,null,null,null,null,null,null,null,null,null,null,null,null,null,null,null,null,null,null,null,null,null,null,null,null,null,null,null,414,"Trestan Ebner","CHI",23,"RB",17,0,8,2,0.25,8,4,0,0,6,1,0.1,0.5,2]
[null,null,null,null,null,null,null,null,null,null,null,null,null,null,null,null,null,null,null,null,null,null,null,null,null,null,null,null,null,null,null,null,null,null,null,null,null,null,null,null,null,null,null,null,null,null,null,null,null,null,null,null,415,"Demetric Felton","CLE",24,"RB",8,2,4,2,0.5,8,4,0,0,5,2,0.3,1,1]
[null,null,null,null,null,null,null,null,null,null,null,null,null,null,null,null,null,null,null,null,null,null,null,null,null,null,null,null,null,null,null,null,null,null,null,null,null,null,null,null,null,null,null,null,null,null,null,null,null,null,null,null,416,"Jalen Guyton","LAC",25,"WR",3,0,4,2,0.5,64,32,0,2,54,16,0.7,21.3,0]
[null,null,null,null,null,null,null,null,null,null,null,null,null,null,null,null,null,null,null,null,null,null,null,null,null,null,null,null,null,null,null,null,null,null,null,null,null,null,null,null,null,null,null,null,null,null,null,null,null,null,null,null,417,"Deonte Harty","NOR",25,"WR",4,0,2,2,1,13,6.5,0,0,9,6.5,0.5,3.3,1]
[null,null,null,null,null,null,null,null,null,null,null,null,null,null,null,null,null,null,null,null,null,null,null,null,null,null,null,null,null,null,null,null,null,null,null,null,null,null,null,null,null,null,null,null,null,null,null,null,null,null,null,null,418,"Justin Herbert","LAC",24,"QB",17,17,2,2,1,-10,-5,0,0,-2,-5,0.1,-0.6,8]
[null,null,null,null,null,null,null,null,null,null,null,null,null,null,null,null,null,null,null,null,null,null,null,null,null,null,null,null,null,null,null,null,null,null,null,null,null,null,null,null,null,null,null,null,null,null,null,null,null,null,null,null,419,"Dennis Houston","DAL",23,"WR",2,0,6,2,0.33300000000000002,16,8,0,0,11,2.7,1,8,0]
[null,null,null,null,null,null,null,null,null,null,null,null,null,null,null,null,null,null,null,null,null,null,null,null,null,null,null,null,null,null,null,null,null,null,null,null,null,null,null,null,null,null,null,null,null,null,null,null,null,null,null,null,"Rk","Player","Tm","Age","Pos","G","GS","Tgt","Rec","Ctch%","Yds","Y/R","TD","1D","Lng","Y/Tgt","R/G","Y/G","Fmb"]
[null,null,null,null,null,null,null,null,null,null,null,null,null,null,null,null,null,null,null,null,null,null,null,null,null,null,null,null,null,null,null,null,null,null,null,null,null,null,null,null,null,null,null,null,null,null,null,null,null,null,null,null,420,"Lil'Jordan Humphrey","NWE",24,"WR",6,2,4,2,0.5,20,10,0,0,11,5,0.3,3.3,0]
[null,null,null,null,null,null,null,null,null,null,null,null,null,null,null,null,null,null,null,null,null,null,null,null,null,null,null,null,null,null,null,null,null,null,null,null,null,null,null,null,null,null,null,null,null,null,null,null,null,null,null,null,421,"Caleb Huntley","ATL",24,"RB",12,0,2,2,1,3,1.5,0,0,2,1.5,0.2,0.3,1]
[null,null,null,null,null,null,null,null,null,null,null,null,null,null,null,null,null,null,null,null,null,null,null,null,null,null,null,null,null,null,null,null,null,null,null,null,null,null,null,null,null,null,null,null,null,null,null,null,null,null,null,null,422,"Andy Isabella","2TM",26,null,5,0,5,2,0.4,21,10.5,0,2,11,4.2,0.4,4.2,0]
[null,null,null,null,null,null,null,null,null,null,null,null,null,null,null,null,null,null,null,null,null,null,null,null,null,null,null,null,null,null,null,null,null,null,null,null,null,null,null,null,null,null,null,null,null,null,null,null,null,null,null,null,423,"Cade Johnson","SEA",24,"WR",3,0,4,2,0.5,21,10.5,0,2,11,5.3,0.7,7,0]
[null,null,null,null,null,null,null,null,null,null,null,null,null,null,null,null,null,null,null,null,null,null,null,null,null,null,null,null,null,null,null,null,null,null,null,null,null,null,null,null,null,null,null,null,null,null,null,null,null,null,null,null,424,"Keith Kirkwood","NOR",28,"WR",5,1,4,2,0.5,18,9,0,1,14,4.5,0.4,3.6,0]
[null,null,null,null,null,null,null,null,null,null,null,null,null,null,null,null,null,null,null,null,null,null,null,null,null,null,null,null,null,null,null,null,null,null,null,null,null,null,null,null,null,null,null,null,null,null,null,null,null,null,null,null,425,"Anthony McFarland Jr.","PIT",23,"RB",1,0,2,2,1,11,5.5,0,1,12,5.5,2,11,0]
[null,null,null,null,null,null,null,null,null,null,null,null,null,null,null,null,null,null,null,null,null,null,null,null,null,null,null,null,null,null,null,null,null,null,null,null,null,null,null,null,null,null,null,null,null,null,null,null,null,null,null,null,426,"Sean McKeon","DAL",25,"TE",13,0,3,2,0.66700000000000004,11,5.5,0,1,10,3.7,0.2,0.8,0]
[null,null,null,null,null,null,null,null,null,null,null,null,null,null,null,null,null,null,null,null,null,null,null,null,null,null,null,null,null,null,null,null,null,null,null,null,null,null,null,null,null,null,null,null,null,null,null,null,null,null,null,null,427,"Racey McMath","TEN",23,"WR",5,0,8,2,0.25,40,20,0,1,39,5,0.4,8,0]
[null,null,null,null,null,null,null,null,null,null,null,null,null,null,null,null,null,null,null,null,null,null,null,null,null,null,null,null,null,null,null,null,null,null,null,null,null,null,null,null,null,null,null,null,null,null,null,null,null,null,null,null,428,"Kene Nwangwu","MIN",24,"RB",17,0,2,2,1,21,10.5,0,1,16,10.5,0.1,1.2,0]
[null,null,null,null,null,null,null,null,null,null,null,null,null,null,null,null,null,null,null,null,null,null,null,null,null,null,null,null,null,null,null,null,null,null,null,null,null,null,null,null,null,null,null,null,null,null,null,null,null,null,null,null,429,"Dezmon Patmon","IND",24,"WR",1,0,6,2,0.33300000000000002,24,12,0,1,17,4,2,24,0]
[null,null,null,null,null,null,null,null,null,null,null,null,null,null,null,null,null,null,null,null,null,null,null,null,null,null,null,null,null,null,null,null,null,null,null,null,null,null,null,null,null,null,null,null,null,null,null,null,null,null,null,null,430,"Larry Rountree","LAC",23,"RB",4,0,2,2,1,14,7,0,1,13,7,0.5,3.5,0]
[null,null,null,null,null,null,null,null,null,null,null,null,null,null,null,null,null,null,null,null,null,null,null,null,null,null,null,null,null,null,null,null,null,null,null,null,null,null,null,null,null,null,null,null,null,null,null,null,null,null,null,null,431,"Drew Sample","CIN",26,"TE",2,2,2,2,1,-2,-1,0,0,2,-1,1,-1,0]
[null,null,null,null,null,null,null,null,null,null,null,null,null,null,null,null,null,null,null,null,null,null,null,null,null,null,null,null,null,null,null,null,null,null,null,null,null,null,null,null,null,null,null,null,null,null,null,null,null,null,null,null,432,"Braylon Sanders","MIA",23,"WR",3,0,3,2,0.66700000000000004,17,8.5,0,0,13,5.7,0.7,5.7,1]
[null,null,null,null,null,null,null,null,null,null,null,null,null,null,null,null,null,null,null,null,null,null,null,null,null,null,null,null,null,null,null,null,null,null,null,null,null,null,null,null,null,null,null,null,null,null,null,null,null,null,null,null,433,"Mason Schreck","HOU",29,"TE",3,1,2,2,1,6,3,0,0,6,3,0.7,2,0]
[null,null,null,null,null,null,null,null,null,null,null,null,null,null,null,null,null,null,null,null,null,null,null,null,null,null,null,null,null,null,null,null,null,null,null,null,null,null,null,null,null,null,null,null,null,null,null,null,null,null,null,null,434,"Benny Snell Jr.","PIT",24,"RB",17,0,2,2,1,17,8.5,0,1,11,8.5,0.1,1,0]
[null,null,null,null,null,null,null,null,null,null,null,null,null,null,null,null,null,null,null,null,null,null,null,null,null,null,null,null,null,null,null,null,null,null,null,null,null,null,null,null,null,null,null,null,null,null,null,null,null,null,null,null,435,"Stephen Sullivan","CAR",26,"TE",14,0,6,2,0.33300000000000002,46,23,0,2,33,7.7,0.1,3.3,0]
[null,null,null,null,null,null,null,null,null,null,null,null,null,null,null,null,null,null,null,null,null,null,null,null,null,null,null,null,null,null,null,null,null,null,null,null,null,null,null,null,null,null,null,null,null,null,null,null,null,null,null,null,436,"Mike Thomas","CIN",28,"WR",10,2,10,2,0.2,38,19,0,1,33,3.8,0.2,3.8,0]
[null,null,null,null,null,null,null,null,null,null,null,null,null,null,null,null,null,null,null,null,null,null,null,null,null,null,null,null,null,null,null,null,null,null,null,null,null,null,null,null,null,null,null,null,null,null,null,null,null,null,null,null,437,"Jalen Tolbert","DAL",23,"WR",8,1,3,2,0.66700000000000004,12,6,0,0,8,4,0.3,1.5,0]
[null,null,null,null,null,null,null,null,null,null,null,null,null,null,null,null,null,null,null,null,null,null,null,null,null,null,null,null,null,null,null,null,null,null,null,null,null,null,null,null,null,null,null,null,null,null,null,null,null,null,null,null,438,"Austin Trammell","LAR",24,"WR",6,0,4,2,0.5,13,6.5,0,1,8,3.3,0.3,2.2000000000000002,0]
[null,null,null,null,null,null,null,null,null,null,null,null,null,null,null,null,null,null,null,null,null,null,null,null,null,null,null,null,null,null,null,null,null,null,null,null,null,null,null,null,null,null,null,null,null,null,null,null,null,null,null,null,439,"Cole Turner","WAS",22,"TE",10,2,9,2,0.222,23,11.5,0,1,18,2.6,0.2,2.2999999999999998,0]
[null,null,null,null,null,null,null,null,null,null,null,null,null,null,null,null,null,null,null,null,null,null,null,null,null,null,null,null,null,null,null,null,null,null,null,null,null,null,null,null,null,null,null,null,null,null,null,null,null,null,null,null,440,"Jalen Virgil","DEN",24,"WR",9,1,5,2,0.4,75,37.5,1,2,66,15,0.2,8.3000000000000007,1]
[null,null,null,null,null,null,null,null,null,null,null,null,null,null,null,null,null,null,null,null,null,null,null,null,null,null,null,null,null,null,null,null,null,null,null,null,null,null,null,null,null,null,null,null,null,null,null,null,null,null,null,null,441,"Jonathan Ward","2TM",25,null,8,0,3,2,0.66700000000000004,7,3.5,0,1,4,2.2999999999999998,0.3,0.9,0]
[null,null,null,null,null,null,null,null,null,null,null,null,null,null,null,null,null,null,null,null,null,null,null,null,null,null,null,null,null,null,null,null,null,null,null,null,null,null,null,null,null,null,null,null,null,null,null,null,null,null,null,null,442,"Nsimba Webster","CHI",26,"WR",2,0,3,2,0.66700000000000004,14,7,0,1,8,4.7,1,7,1]
[null,null,null,null,null,null,null,null,null,null,null,null,null,null,null,null,null,null,null,null,null,null,null,null,null,null,null,null,null,null,null,null,null,null,null,null,null,null,null,null,null,null,null,null,null,null,null,null,null,null,null,null,443,"Trevon Wesco","CHI",27,"TE",14,1,4,2,0.5,26,13,0,1,23,6.5,0.1,1.9,0]
[null,null,null,null,null,null,null,null,null,null,null,null,null,null,null,null,null,null,null,null,null,null,null,null,null,null,null,null,null,null,null,null,null,null,null,null,null,null,null,null,null,null,null,null,null,null,null,null,null,null,null,null,444,"Kevin White","NOR",30,"WR",7,2,5,2,0.4,74,37,0,2,64,14.8,0.3,10.6,0]
[null,null,null,null,null,null,null,null,null,null,null,null,null,null,null,null,null,null,null,null,null,null,null,null,null,null,null,null,null,null,null,null,null,null,null,null,null,null,null,null,null,null,null,null,null,null,null,null,null,null,null,null,445,"Trayveon Williams","CIN",25,"RB",8,0,3,2,0.66700000000000004,30,15,0,1,24,10,0.3,3.8,0]
[null,null,null,null,null,null,null,null,null,null,null,null,null,null,null,null,null,null,null,null,null,null,null,null,null,null,null,null,null,null,null,null,null,null,null,null,null,null,null,null,null,null,null,null,null,null,null,null,null,null,null,null,446,"Dareke Young","SEA",23,"WR",13,0,2,2,1,24,12,0,2,12,12,0.2,1.8,0]
[null,null,null,null,null,null,null,null,null,null,null,null,null,null,null,null,null,null,null,null,null,null,null,null,null,null,null,null,null,null,null,null,null,null,null,null,null,null,null,null,null,null,null,null,null,null,null,null,null,null,null,null,447,"Salvon Ahmed","MIA",24,"RB",12,0,1,1,1,8,8,0,0,8,8,0.1,0.7,0]
[null,null,null,null,null,null,null,null,null,null,null,null,null,null,null,null,null,null,null,null,null,null,null,null,null,null,null,null,null,null,null,null,null,null,null,null,null,null,null,null,null,null,null,null,null,null,null,null,null,null,null,null,448,"Maurice Alexander","DET",25,"WR",4,0,1,1,1,7,7,0,0,7,7,0.3,1.8,0]
[null,null,null,null,null,null,null,null,null,null,null,null,null,null,null,null,null,null,null,null,null,null,null,null,null,null,null,null,null,null,null,null,null,null,null,null,null,null,null,null,null,null,null,null,null,null,null,null,null,null,null,null,449,"Tyler Badie","DEN",22,"RB",1,0,1,1,1,24,24,1,1,24,24,1,24,0]
[null,null,null,null,null,null,null,null,null,null,null,null,null,null,null,null,null,null,null,null,null,null,null,null,null,null,null,null,null,null,null,null,null,null,null,null,null,null,null,null,null,null,null,null,null,null,null,null,null,null,null,null,"Rk","Player","Tm","Age","Pos","G","GS","Tgt","Rec","Ctch%","Yds","Y/R","TD","1D","Lng","Y/Tgt","R/G","Y/G","Fmb"]
[null,null,null,null,null,null,null,null,null,null,null,null,null,null,null,null,null,null,null,null,null,null,null,null,null,null,null,null,null,null,null,null,null,null,null,null,null,null,null,null,null,null,null,null,null,null,null,null,null,null,null,null,450,"C.J. Board","TEN",29,"WR",4,0,1,1,1,6,6,0,0,6,6,0.3,1.5,1]
[null,null,null,null,null,null,null,null,null,null,null,null,null,null,null,null,null,null,null,null,null,null,null,null,null,null,null,null,null,null,null,null,null,null,null,null,null,null,null,null,null,null,null,null,null,null,null,null,null,null,null,null,451,"John Brown","BUF",32,"WR",3,0,2,1,0.5,42,42,1,1,42,21,0.3,14,0]
[null,null,null,null,null,null,null,null,null,null,null,null,null,null,null,null,null,null,null,null,null,null,null,null,null,null,null,null,null,null,null,null,null,null,null,null,null,null,null,null,null,null,null,null,null,null,null,null,null,null,null,null,452,"Jason Cabinda","DET",26,"FB",8,2,4,1,0.25,5,5,0,1,5,1.3,0.1,0.6,0]
[null,null,null,null,null,null,null,null,null,null,null,null,null,null,null,null,null,null,null,null,null,null,null,null,null,null,null,null,null,null,null,null,null,null,null,null,null,null,null,null,null,null,null,null,null,null,null,null,null,null,null,null,453,"Jalen Camp","HOU",24,"WR",2,0,1,1,1,7,7,0,1,7,7,0.5,3.5,0]
[null,null,null,null,null,null,null,null,null,null,null,null,null,null,null,null,null,null,null,null,null,null,null,null,null,null,null,null,null,null,null,null,null,null,null,null,null,null,null,null,null,null,null,null,null,null,null,null,null,null,null,null,454,"Keke Coutee","IND",25,"WR",8,0,1,1,1,20,20,0,0,20,20,0.1,2.5,4]
[null,null,null,null,null,null,null,null,null,null,null,null,null,null,null,null,null,null,null,null,null,null,null,null,null,null,null,null,null,null,null,null,null,null,null,null,null,null,null,null,null,null,null,null,null,null,null,null,null,null,null,null,455,"Frank Darby","ATL",25,"WR",5,0,1,1,1,15,15,0,1,15,15,0.2,3,0]
[null,null,null,null,null,null,null,null,null,null,null,null,null,null,null,null,null,null,null,null,null,null,null,null,null,null,null,null,null,null,null,null,null,null,null,null,null,null,null,null,null,null,null,null,null,null,null,null,null,null,null,null,456,"Jeff Driskel","HOU",29,"QB",7,2,1,1,1,4,4,0,0,4,4,0.1,0.6,0]
[null,null,null,null,null,null,null,null,null,null,null,null,null,null,null,null,null,null,null,null,null,null,null,null,null,null,null,null,null,null,null,null,null,null,null,null,null,null,null,null,null,null,null,null,null,null,null,null,null,null,null,null,457,"Darrynton Evans","CHI",24,"RB",6,0,1,1,1,33,33,0,1,33,33,0.2,5.5,0]
[null,null,null,null,null,null,null,null,null,null,null,null,null,null,null,null,null,null,null,null,null,null,null,null,null,null,null,null,null,null,null,null,null,null,null,null,null,null,null,null,null,null,null,null,null,null,null,null,null,null,null,null,458,"Erik Ezukanma","MIA",22,"WR",1,0,1,1,1,3,3,0,0,3,3,1,3,0]
[null,null,null,null,null,null,null,null,null,null,null,null,null,null,null,null,null,null,null,null,null,null,null,null,null,null,null,null,null,null,null,null,null,null,null,null,null,null,null,null,null,null,null,null,null,null,null,null,null,null,null,null,459,"Jake Gervase","LAR",27,"LB",14,0,1,1,1,12,12,0,1,12,12,0.1,0.9,0]
[null,null,null,null,null,null,null,null,null,null,null,null,null,null,null,null,null,null,null,null,null,null,null,null,null,null,null,null,null,null,null,null,null,null,null,null,null,null,null,null,null,null,null,null,null,null,null,null,null,null,null,null,460,"Jared Goff","DET",28,"QB",17,17,1,1,1,5,5,0,0,5,5,0.1,0.3,7]
[null,null,null,null,null,null,null,null,null,null,null,null,null,null,null,null,null,null,null,null,null,null,null,null,null,null,null,null,null,null,null,null,null,null,null,null,null,null,null,null,null,null,null,null,null,null,null,null,null,null,null,null,461,"Danny Gray","SFO",23,"WR",13,0,7,1,0.14299999999999999,10,10,0,1,10,1.4,0.1,0.8,0]
[null,null,null,null,null,null,null,null,null,null,null,null,null,null,null,null,null,null,null,null,null,null,null,null,null,null,null,null,null,null,null,null,null,null,null,null,null,null,null,null,null,null,null,null,null,null,null,null,null,null,null,null,462,"Kamu Grugier-Hill","2TM",28,"LB/OLB",15,6,1,1,1,4,4,0,1,4,4,0.1,0.3,0]
[null,null,null,null,null,null,null,null,null,null,null,null,null,null,null,null,null,null,null,null,null,null,null,null,null,null,null,null,null,null,null,null,null,null,null,null,null,null,null,null,null,null,null,null,null,null,null,null,null,null,null,null,463,"Jacob Harris","LAR",25,"WR",7,0,1,1,1,6,6,0,1,6,6,0.1,0.9,0]
[null,null,null,null,null,null,null,null,null,null,null,null,null,null,null,null,null,null,null,null,null,null,null,null,null,null,null,null,null,null,null,null,null,null,null,null,null,null,null,null,null,null,null,null,null,null,null,null,null,null,null,null,464,"Godwin Igwebuike","SEA",28,"RB",5,0,1,1,1,3,3,0,0,3,3,0.2,0.6,0]
[null,null,null,null,null,null,null,null,null,null,null,null,null,null,null,null,null,null,null,null,null,null,null,null,null,null,null,null,null,null,null,null,null,null,null,null,null,null,null,null,null,null,null,null,null,null,null,null,null,null,null,null,465,"Tyron Johnson","2TM",26,"WR",4,1,1,1,1,8,8,0,0,8,8,0.3,2,0]
[null,null,null,null,null,null,null,null,null,null,null,null,null,null,null,null,null,null,null,null,null,null,null,null,null,null,null,null,null,null,null,null,null,null,null,null,null,null,null,null,null,null,null,null,null,null,null,null,null,null,null,null,466,"Ronald Jones II","KAN",25,"RB",6,0,1,1,1,22,22,0,1,22,22,0.2,3.7,0]
[null,null,null,null,null,null,null,null,null,null,null,null,null,null,null,null,null,null,null,null,null,null,null,null,null,null,null,null,null,null,null,null,null,null,null,null,null,null,null,null,null,null,null,null,null,null,null,null,null,null,null,null,467,"Mason Kinsey","TEN",24,"WR",2,0,1,1,1,3,3,0,0,3,3,0.5,1.5,1]
[null,null,null,null,null,null,null,null,null,null,null,null,null,null,null,null,null,null,null,null,null,null,null,null,null,null,null,null,null,null,null,null,null,null,null,null,null,null,null,null,null,null,null,null,null,null,null,null,null,null,null,null,468,"Tyler Mabry","SEA",26,"TE",2,0,1,1,1,7,7,1,1,7,7,0.5,3.5,0]
[null,null,null,null,null,null,null,null,null,null,null,null,null,null,null,null,null,null,null,null,null,null,null,null,null,null,null,null,null,null,null,null,null,null,null,null,null,null,null,null,null,null,null,null,null,null,null,null,null,null,null,null,469,"Patrick Mahomes","KAN",27,"QB",17,17,1,1,1,6,6,0,0,6,6,0.1,0.4,5]
[null,null,null,null,null,null,null,null,null,null,null,null,null,null,null,null,null,null,null,null,null,null,null,null,null,null,null,null,null,null,null,null,null,null,null,null,null,null,null,null,null,null,null,null,null,null,null,null,null,null,null,null,470,"Jason Moore","LAC",27,"WR",6,0,2,1,0.5,5,5,0,0,5,2.5,0.2,0.8,0]
[null,null,null,null,null,null,null,null,null,null,null,null,null,null,null,null,null,null,null,null,null,null,null,null,null,null,null,null,null,null,null,null,null,null,null,null,null,null,null,null,null,null,null,null,null,null,null,null,null,null,null,null,471,"Devine Ozigbo","DEN",26,"RB",4,0,1,1,1,3,3,0,0,3,3,0.3,0.8,0]
[null,null,null,null,null,null,null,null,null,null,null,null,null,null,null,null,null,null,null,null,null,null,null,null,null,null,null,null,null,null,null,null,null,null,null,null,null,null,null,null,null,null,null,null,null,null,null,null,null,null,null,null,472,"Richard Rodgers","LAC",30,"TE",10,1,4,1,0.25,4,4,0,0,4,1,0.1,0.4,0]
[null,null,null,null,null,null,null,null,null,null,null,null,null,null,null,null,null,null,null,null,null,null,null,null,null,null,null,null,null,null,null,null,null,null,null,null,null,null,null,null,null,null,null,null,null,null,null,null,null,null,null,null,473,"Jeremy Ruckert","NYJ",22,"TE",9,0,2,1,0.5,8,8,0,0,8,4,0.1,0.9,0]
[null,null,null,null,null,null,null,null,null,null,null,null,null,null,null,null,null,null,null,null,null,null,null,null,null,null,null,null,null,null,null,null,null,null,null,null,null,null,null,null,null,null,null,null,null,null,null,null,null,null,null,null,474,"Penei Sewell","DET",22,"T",17,17,1,1,1,9,9,0,1,9,9,0.1,0.5,0]
[null,null,null,null,null,null,null,null,null,null,null,null,null,null,null,null,null,null,null,null,null,null,null,null,null,null,null,null,null,null,null,null,null,null,null,null,null,null,null,null,null,null,null,null,null,null,null,null,null,null,null,null,475,"Keith Smith","ATL",30,"FB",17,6,2,1,0.5,8,8,0,0,8,4,0.1,0.5,0]
[null,null,null,null,null,null,null,null,null,null,null,null,null,null,null,null,null,null,null,null,null,null,null,null,null,null,null,null,null,null,null,null,null,null,null,null,null,null,null,null,null,null,null,null,null,null,null,null,null,null,null,null,476,"Ihmir Smith-Marsette","2TM",23,null,8,0,4,1,0.25,15,15,0,0,15,3.8,0.1,1.9,1]
[null,null,null,null,null,null,null,null,null,null,null,null,null,null,null,null,null,null,null,null,null,null,null,null,null,null,null,null,null,null,null,null,null,null,null,null,null,null,null,null,null,null,null,null,null,null,null,null,null,null,null,null,477,"Tommy Sweeney","BUF",27,"TE",5,0,1,1,1,7,7,0,1,7,7,0.2,1.4,0]
[null,null,null,null,null,null,null,null,null,null,null,null,null,null,null,null,null,null,null,null,null,null,null,null,null,null,null,null,null,null,null,null,null,null,null,null,null,null,null,null,null,null,null,null,null,null,null,null,null,null,null,null,478,"J.J. Taylor","NWE",24,"RB",1,0,1,1,1,8,8,0,0,8,8,1,8,0]
[null,null,null,null,null,null,null,null,null,null,null,null,null,null,null,null,null,null,null,null,null,null,null,null,null,null,null,null,null,null,null,null,null,null,null,null,null,null,null,null,null,null,null,null,null,null,null,null,null,null,null,null,479,"Patrick Taylor","GNB",24,"RB",14,0,1,1,1,17,17,0,1,17,17,0.1,1.2,0]
[null,null,null,null,null,null,null,null,null,null,null,null,null,null,null,null,null,null,null,null,null,null,null,null,null,null,null,null,null,null,null,null,null,null,null,null,null,null,null,null,null,null,null,null,null,null,null,null,null,null,null,null,"Rk","Player","Tm","Age","Pos","G","GS","Tgt","Rec","Ctch%","Yds","Y/R","TD","1D","Lng","Y/Tgt","R/G","Y/G","Fmb"]
[null,null,null,null,null,null,null,null,null,null,null,null,null,null,null,null,null,null,null,null,null,null,null,null,null,null,null,null,null,null,null,null,null,null,null,null,null,null,null,null,null,null,null,null,null,null,null,null,null,null,null,null,480,"KaVontae Turpin","DAL",26,"WR",17,0,2,1,0.5,9,9,0,0,9,4.5,0.1,0.5,3]
[null,null,null,null,null,null,null,null,null,null,null,null,null,null,null,null,null,null,null,null,null,null,null,null,null,null,null,null,null,null,null,null,null,null,null,null,null,null,null,null,null,null,null,null,null,null,null,null,null,null,null,null,481,"Dwayne Washington","NOR",28,"RB",12,0,1,1,1,7,7,0,0,7,7,0.1,0.6,0]
[null,null,null,null,null,null,null,null,null,null,null,null,null,null,null,null,null,null,null,null,null,null,null,null,null,null,null,null,null,null,null,null,null,null,null,null,null,null,null,null,null,null,null,null,null,null,null,null,null,null,null,null,482,"Cody White","PIT",24,"WR",1,1,1,1,1,2,2,0,0,2,2,1,2,0]
[null,null,null,null,null,null,null,null,null,null,null,null,null,null,null,null,null,null,null,null,null,null,null,null,null,null,null,null,null,null,null,null,null,null,null,null,null,null,null,null,null,null,null,null,null,null,null,null,null,null,null,null,483,"Jameson Williams","DET",21,"WR",6,0,9,1,0.111,41,41,1,1,41,4.5999999999999996,0.2,6.8,0]
[null,null,null,null,null,null,null,null,null,null,null,null,null,null,null,null,null,null,null,null,null,null,null,null,null,null,null,null,null,null,null,null,null,null,null,null,null,null,null,null,null,null,null,null,null,null,null,null,null,null,null,null,484,"Ty'Son Williams","ARI",26,"RB",1,0,1,1,1,5,5,0,0,5,5,1,5,0]
[null,null,null,null,null,null,null,null,null,null,null,null,null,null,null,null,null,null,null,null,null,null,null,null,null,null,null,null,null,null,null,null,null,null,null,null,null,null,null,null,null,null,null,null,null,null,null,null,null,null,null,null,485,"Russell Wilson","DEN",34,"QB",15,15,1,1,1,1,1,0,0,1,1,0.1,0.1,6]
[null,null,null,null,null,null,null,null,null,null,null,null,null,null,null,null,null,null,null,null,null,null,null,null,null,null,null,null,null,null,null,null,null,null,null,null,null,null,null,null,null,null,null,null,null,null,null,null,null,null,null,null,486,"Zach Wilson","NYJ",23,"QB",9,9,1,1,1,2,2,1,1,2,2,0.1,0.2,1]
[null,null,null,null,null,null,null,null,null,null,null,null,null,null,null,null,null,null,null,null,null,null,null,null,null,null,null,null,null,null,null,null,null,null,null,null,null,null,null,null,null,null,null,null,null,null,null,null,null,null,null,null,487,"Juwann Winfree","GNB",26,"WR",3,0,4,1,0.25,17,17,0,1,17,4.3,0.3,5.7,0]
[null,null,null,null,null,null,null,null,null,null,null,null,null,null,null,null,null,null,null,null,null,null,null,null,null,null,null,null,null,null,null,null,null,null,null,null,null,null,null,null,null,null,null,null,null,null,null,null,null,null,null,null,488,"Bailey Zappe","NWE",23,"QB",4,2,1,1,1,-6,-6,0,0,-6,-6,0.3,-1.5,4]
[null,null,null,null,null,null,null,null,null,null,null,null,null,null,null,null,null,null,null,null,null,null,null,null,null,null,null,null,null,null,null,null,null,null,null,null,null,null,null,null,null,null,null,null,null,null,null,null,null,null,null,null,489,"Josh Ali","ATL",23,"WR",2,0,1,0,0,0,null,0,0,0,0,0,0,0]
[null,null,null,null,null,null,null,null,null,null,null,null,null,null,null,null,null,null,null,null,null,null,null,null,null,null,null,null,null,null,null,null,null,null,null,null,null,null,null,null,null,null,null,null,null,null,null,null,null,null,null,null,490,"David Bakhtiari","GNB",31,"T",11,11,1,0,0,0,null,0,0,0,0,0,0,0]
[null,null,null,null,null,null,null,null,null,null,null,null,null,null,null,null,null,null,null,null,null,null,null,null,null,null,null,null,null,null,null,null,null,null,null,null,null,null,null,null,null,null,null,null,null,null,null,null,null,null,null,null,491,"Khari Blasingame","CHI",26,"FB",16,6,1,0,0,0,null,0,0,0,0,0,0,0]
[null,null,null,null,null,null,null,null,null,null,null,null,null,null,null,null,null,null,null,null,null,null,null,null,null,null,null,null,null,null,null,null,null,null,null,null,null,null,null,null,null,null,null,null,null,null,null,null,null,null,null,null,492,"Tom Brady","TAM",45,"QB",17,17,1,0,0,0,null,0,0,0,0,0,0,5]
[null,null,null,null,null,null,null,null,null,null,null,null,null,null,null,null,null,null,null,null,null,null,null,null,null,null,null,null,null,null,null,null,null,null,null,null,null,null,null,null,null,null,null,null,null,null,null,null,null,null,null,null,493,"Jack Conklin","CLE",28,"T",14,14,1,0,0,0,null,0,0,0,0,0,0,0]
[null,null,null,null,null,null,null,null,null,null,null,null,null,null,null,null,null,null,null,null,null,null,null,null,null,null,null,null,null,null,null,null,null,null,null,null,null,null,null,null,null,null,null,null,null,null,null,null,null,null,null,null,494,"Tanner Conner","MIA",24,"TE",13,0,3,0,0,0,null,0,0,0,0,0,0,0]
[null,null,null,null,null,null,null,null,null,null,null,null,null,null,null,null,null,null,null,null,null,null,null,null,null,null,null,null,null,null,null,null,null,null,null,null,null,null,null,null,null,null,null,null,null,null,null,null,null,null,null,null,495,"Tyrion Davis-Price","SFO",22,"RB",6,0,2,0,0,0,null,0,0,0,0,0,0,0]
[null,null,null,null,null,null,null,null,null,null,null,null,null,null,null,null,null,null,null,null,null,null,null,null,null,null,null,null,null,null,null,null,null,null,null,null,null,null,null,null,null,null,null,null,null,null,null,null,null,null,null,null,496,"Gus Edwards","BAL",27,"RB",9,4,2,0,0,0,null,0,0,0,0,0,0,1]
[null,null,null,null,null,null,null,null,null,null,null,null,null,null,null,null,null,null,null,null,null,null,null,null,null,null,null,null,null,null,null,null,null,null,null,null,null,null,null,null,null,null,null,null,null,null,null,null,null,null,null,null,497,"Miller Forristall","CLE",24,"TE",4,0,1,0,0,0,null,0,0,0,0,0,0,0]
[null,null,null,null,null,null,null,null,null,null,null,null,null,null,null,null,null,null,null,null,null,null,null,null,null,null,null,null,null,null,null,null,null,null,null,null,null,null,null,null,null,null,null,null,null,null,null,null,null,null,null,null,498,"Feleipe Franks","ATL",25,"TE",11,1,2,0,0,0,null,0,0,0,0,0,0,0]
[null,null,null,null,null,null,null,null,null,null,null,null,null,null,null,null,null,null,null,null,null,null,null,null,null,null,null,null,null,null,null,null,null,null,null,null,null,null,null,null,null,null,null,null,null,null,null,null,null,null,null,null,499,"Tanner Gentry","BUF",28,"WR",3,0,1,0,0,0,null,0,0,0,0,0,0,0]
[null,null,null,null,null,null,null,null,null,null,null,null,null,null,null,null,null,null,null,null,null,null,null,null,null,null,null,null,null,null,null,null,null,null,null,null,null,null,null,null,null,null,null,null,null,null,null,null,null,null,null,null,500,"Josh Gordon","TEN",31,"WR",2,0,1,0,0,0,null,0,0,0,0,0,0,0]
[null,null,null,null,null,null,null,null,null,null,null,null,null,null,null,null,null,null,null,null,null,null,null,null,null,null,null,null,null,null,null,null,null,null,null,null,null,null,null,null,null,null,null,null,null,null,null,null,null,null,null,null,501,"Lance McCutcheon","LAR",23,"WR",10,1,5,0,0,0,null,0,0,0,0,0,0,0]
[null,null,null,null,null,null,null,null,null,null,null,null,null,null,null,null,null,null,null,null,null,null,null,null,null,null,null,null,null,null,null,null,null,null,null,null,null,null,null,null,null,null,null,null,null,null,null,null,null,null,null,null,502,"Stanley Morgan Jr.","CIN",26,"WR",14,0,1,0,0,0,null,0,0,0,0,0,0,0]
[null,null,null,null,null,null,null,null,null,null,null,null,null,null,null,null,null,null,null,null,null,null,null,null,null,null,null,null,null,null,null,null,null,null,null,null,null,null,null,null,null,null,null,null,null,null,null,null,null,null,null,null,503,"Jaret Patterson","WAS",23,"RB",3,0,1,0,0,0,null,0,0,0,0,0,0,0]
[null,null,null,null,null,null,null,null,null,null,null,null,null,null,null,null,null,null,null,null,null,null,null,null,null,null,null,null,null,null,null,null,null,null,null,null,null,null,null,null,null,null,null,null,null,null,null,null,null,null,null,null,504,"Noah Togiai","PHI",25,"TE",2,0,1,0,0,0,null,0,0,0,0,0,0,0]
[null,null,null,null,null,null,null,null,null,null,null,null,null,null,null,null,null,null,null,null,null,null,null,null,null,null,null,null,null,null,null,null,null,null,null,null,null,null,null,null,null,null,null,null,null,null,null,null,null,null,null,null,505,"Jake Tonges","CHI",23,"TE",4,0,1,0,0,0,null,0,0,0,0,0,0,0]
[null,null,null,null,null,null,null,null,null,null,null,null,null,null,null,null,null,null,null,null,null,null,null,null,null,null,null,null,null,null,null,null,null,null,null,null,null,null,null,null,null,null,null,null,null,null,null,null,null,null,null,null,506,"DJ Turner","LVR",25,"WR",9,0,1,0,0,0,null,0,0,0,0,0,0,1]
[null,null,null,null,null,null,null,null,null,null,null,null,null,null,null,null,null,null,null,null,null,null,null,null,null,null,null,null,null,null,null,null,null,null,null,null,null,null,null,null,null,null,null,null,null,null,null,null,null,null,null,null,507,"James Washington","DAL",26,"WR",2,0,1,0,0,0,null,0,0,0,0,0,0,0]
[null,null,null,null,null,null,null,null,null,null,null,null,null,null,null,null,null,null,null,null,null,null,null,null,null,null,null,null,null,null,null,null,null,null,null,null,null,null,null,null,null,null,null,null,null,null,null,null,null,null,null,null,508,"Charlie Woerner","SFO",25,"TE",17,2,2,0,0,0,null,0,0,0,0,0,0,0]